{"text_format":"1","workbook":"xlsx","n_sheets":24,"sheets":["INFO Blatt","Ergebnisse","Startreihenfolge","Formeln","Boffzen","TG Oker_Salzg_Wenzen","LaPeKa","Dielmissen","M5","M6","M7","M8","M9","M10","Wertungszettel M1","Wertungszettel M2","Wertungszettel M3","Wertungszettel M4","Wertungszettel M5","Wertungszettel M6","Wertungszettel M7","Wertungszettel M8","Wertungszettel M9","Wertungszettel M10"],"not_rendered":{"charts":0,"images":11,"macros":1,"external_links":2,"defined_names":17,"comments":2,"pivot_tables":0},"unopened":[],"bounds":{"document_bytes":16777216,"sheet_cells":100000,"rows_first":2000,"rows_last":500,"rows_between":2000,"halvings":0,"cell_chars":16384,"cell_head_chars":4096},"cells_cut":0,"cells_raw":0,"read":"whole","date_system":"1900"}

{"sheet":"INFO Blatt","index":0,"n_rows":40,"n_cols":2,"rows_kept":40,"cut":false,"hidden":false,"merged":[[21,0,21,5],[22,0,22,5],[15,0,15,5],[19,1,19,5],[20,1,20,5],[18,0,18,5],[17,0,17,5],[37,0,37,5],[30,1,30,5],[31,1,31,5],[23,1,23,5],[24,1,24,5],[25,0,25,5],[26,0,26,5],[27,1,27,5],[28,1,28,5],[29,0,29,5],[32,1,32,5],[33,0,33,5],[34,1,34,5],[35,1,35,5],[36,1,36,5]]}
["INFO"]
[]
["Mannschaften",5]
[]
["Wertungsvorschrift","P und AK"]
[]
["Liga","Einsteigerliga"]
[]
["Wettkampftag","1."]
[]
["Ort","Hehlen"]
[]
["Datum","2019-02-16"]
[]
[]
["Kleine Einführung in die Auswertung:"]
[]
["1.       Es wird MS Ecxel ab 2007 benötigt. Auf Wunsch kann ich es auch in die 97 Version runterspeichern."]
["2.       Bitte die Datei für den 1 Wettkampftag öffnen. Bzw. den aktuellen. Die Ergebnisse werden von dem letzten                Wettkampftag eingelesen. Dort müsste eventuell der Datenpfad geändert werden."]
[null,"a.       Im Datenblatt Formeln / Daten à Verknüpfung bearbeiten à Quelle ändern à die Datei des letzten Wettkampfes angeben."]
[null,"b.      Wenn ich die Ergebnisse bekomme, kann ich auch die aktuelle Datei an den Ausrichter senden."]
["3.       Für den Wettkampf müssen die Wettkampfzettel ausgedruckt werden. Es gibt immer 2stk. pro Mannschaft. Dort sind immer 3 Geräte aufgeführt. Die Zettel können abwechseln eingegeben werden bzw. am Kari Tisch liegen."]
["4.       Es wird empfohlen das vor Wettkampfbeginn alle anwesenden Turner in die Auswertungstabellen eingelesen werden. Dazu in der Tabelle der Mannschaft / Spalte Namen und dem ersten Namensfeld auf den Pfeil klicken. Es werden alle gemeldeten Turner der Mannschaft aufgelistet."]
[null,"a.       Wenn die Reihenfolge der Wertungszettel  übernommen wird ist es einfacher für die Eingabe. "]
[null,"b.      Falls ein Turner fehlt oder ein Rechtschreibfehler vorliegt. Kann dies unter dem Datenblatt „Wertungszettel M?“ (Nummer der Mannschaft) geändert werden. Danach im muss der Turner neu angewählt werden. Um die Änderung anzuzeigen!"]
["5.       Die Wertungen müssen dann unter den Mannschaften eingetragen werden."]
["Bitte den"]
[null,"a.       Ausgang : 1,4 bzw. bei P-Stufen für P7  = 7"]
[null,"b.       E-Abzug: die Abzüge eintragen ( z.B.1,8) bitte immer 2 Werte eintragen"]
["6.       Platzierungen kann man und dem Datenblatt „Ergebnisse“ finden. Zum Sortieren auf den Button klicken."]
[null,"a.       Achtung dafür müssen die Makro aktiviert sein. Die Dateien sind mit Norton Antivir geprüft."]
[null,"b.      Die Seite ist so ein gestellt das Seite 1 die Mannschaftergebnisse sind und die folgenden die             Einzelergebnisse"]
[null,"c.    Die Arbeitsmappe wird nach dem sortieren automatisch gespeichert."]
["7.        AK Turner werden in dem Programm wie folgt behandelt"]
[null,"a.    Ausgang: Ausgangswerte für Ak Turner müssen negativ eingegeben werden z.B. P7 = -7"]
[null,"b.    Die Endwerte der Ak Turner werden vom Programm automatisch farblich markiert"]
[null,"c.    Für die Einzelergebnisse der Turner werden alle Endwerte korrekt berücksichtigt"]
["8.       Falls Fragen und Hilfen benötigt wird bitte einfach mailen carsten.jeschke@t-online.de"]
[]
[null,"© Alexander Gläsener"]

{"sheet":"Ergebnisse","index":1,"n_rows":114,"n_cols":14,"rows_kept":114,"cut":false,"hidden":false,"merged":[[37,8,37,9],[6,0,6,1],[6,8,6,9],[6,10,6,11],[35,8,35,9],[35,10,35,11],[8,0,8,3],[8,8,8,12]]}
[]
[]
[]
[]
[]
[]
[{"$f":"'INFO Blatt'!B7","v":"Einsteigerliga"},null,{"$f":"'INFO Blatt'!B11","v":"Hehlen"},{"$f":"'INFO Blatt'!B13","v":"2019-02-16"},null,null,null,null,{"$f":"A7","v":"Einsteigerliga"},null,{"$f":"C7","v":"Hehlen"},null,{"$f":"D7","v":"2019-02-16"}]
[]
["Einzelergebnisse",null,null,null,null,null,null,null,"Mannschaftsergebnisse"]
[]
["Platz","Name","Verein","Punkte "]
[{"$f":"IF(D12=0,F12*10+1,RANK(D12,D$12:D$101,0))","v":1},{"$f":"'TG Oker_Salzg_Wenzen'!A13","v":"Emmanuel König"},{"$f":"'TG Oker_Salzg_Wenzen'!B13","v":"TG Oker/Salzgitter/Wenzen"},{"$f":"'TG Oker_Salzg_Wenzen'!AB13","v":95.05},null,{"$f":"200","v":200}]
[2,{"$f":"'TG Oker_Salzg_Wenzen'!A17","v":"Erik Pohler"},{"$f":"'TG Oker_Salzg_Wenzen'!B17","v":"TG Oker/Salzgitter/Wenzen"},{"$f":"'TG Oker_Salzg_Wenzen'!AB17","v":82.9},null,{"$f":"F12","v":200},null,null,"Platz","Verein","WK Punkte","Gerät Punkt","Punkte","Nach Geräten"]
[3,{"$f":"Dielmissen!A9","v":"Sebastian Bocian"},{"$f":"Dielmissen!B9","v":"TSV Dielmissen"},{"$f":"Dielmissen!AB9","v":79.3},null,{"$f":"F13","v":200},null,null,{"$f":"Formeln!C6","v":1},{"$f":"Formeln!A6","v":"TG Oker/Salzgitter/Wenzen"},{"$f":"Formeln!D6","v":12},{"$f":"Formeln!E6","v":70},{"$f":"Formeln!B6","v":251.55},{"$f":"'TG Oker_Salzg_Wenzen'!AG18","v":6}]
[4,{"$f":"Dielmissen!A11","v":"Yannick Schröder"},{"$f":"Dielmissen!B11","v":"TSV Dielmissen"},{"$f":"Dielmissen!AB11","v":77.95},null,{"$f":"F14","v":200},null,null,{"$f":"Formeln!C8","v":2},{"$f":"Formeln!A8","v":"TSV Dielmissen"},{"$f":"Formeln!D8","v":10},{"$f":"Formeln!E8","v":56},{"$f":"Formeln!B8","v":231.14999999999998},{"$f":"Dielmissen!AG18","v":6}]
[5,{"$f":"Boffzen!A15","v":"Nick Bernhardt"},{"$f":"Boffzen!B15","v":"MTV Boffzen e.V. von 1892"},{"$f":"Boffzen!AB15","v":74.25},null,{"$f":"F15","v":200},null,null,{"$f":"Formeln!C5","v":3},{"$f":"Formeln!A5","v":"MTV Boffzen e.V. von 1892"},{"$f":"Formeln!D5","v":8},{"$f":"Formeln!E5","v":52},{"$f":"Formeln!B5","v":227.95000000000002},{"$f":"Boffzen!AG18","v":6}]
[6,{"$f":"'TG Oker_Salzg_Wenzen'!A15","v":"Linus Ankert"},{"$f":"'TG Oker_Salzg_Wenzen'!B15","v":"TG Oker/Salzgitter/Wenzen"},{"$f":"'TG Oker_Salzg_Wenzen'!AB15","v":73.599999999999994},null,200,null,null,{"$f":"Formeln!C7","v":4},{"$f":"Formeln!A7","v":"TG LaPeKa"},{"$f":"Formeln!D7","v":6},{"$f":"Formeln!E7","v":38},{"$f":"Formeln!B7","v":197.60000000000002},{"$f":"LaPeKa!AG18","v":6}]
[7,{"$f":"Dielmissen!A13","v":"Tristan Warmuth"},{"$f":"Dielmissen!B13","v":"TSV Dielmissen"},{"$f":"Dielmissen!AB13","v":73.400000000000006},null,200,null,null,{"$f":"Formeln!C9","v":6},{"$f":"Formeln!A9","v":"M5"},{"$f":"Formeln!D9","v":2},{"$f":"Formeln!E9","v":0},{"$f":"Formeln!B9","v":0},{"$f":"'M5'!AG18","v":0}]
[8,{"$f":"Boffzen!A11","v":"Thorge Haak"},{"$f":"Boffzen!B11","v":"MTV Boffzen e.V. von 1892"},{"$f":"Boffzen!AB11","v":72.899999999999991},null,200,null,null,{"$f":"Formeln!C10","v":6},{"$f":"Formeln!A10","v":"M6"},{"$f":"Formeln!D10","v":2},{"$f":"Formeln!E10","v":0},{"$f":"Formeln!B10","v":0},{"$f":"'M6'!AG18","v":0}]
[9,{"$f":"Boffzen!A21","v":"David Janzen"},{"$f":"Boffzen!B21","v":"MTV Boffzen e.V. von 1892"},{"$f":"Boffzen!AB21","v":72.55},null,200,null,null,{"$f":"Formeln!C11","v":6},{"$f":"Formeln!A11","v":"M7"},{"$f":"Formeln!D11","v":2},{"$f":"Formeln!E11","v":0},{"$f":"Formeln!B11","v":0},{"$f":"'M7'!AG18","v":0}]
[10,{"$f":"Dielmissen!A15","v":"Leon Nolte-Furchner"},{"$f":"Dielmissen!B15","v":"TSV Dielmissen"},{"$f":"Dielmissen!AB15","v":67.95},null,200]
[11,{"$f":"LaPeKa!A19","v":"Jaroslaw Schwentner"},{"$f":"LaPeKa!B19","v":"TG LaPeKa"},{"$f":"LaPeKa!AB19","v":66.75},null,200]
[12,{"$f":"LaPeKa!A9","v":"Lukas Sitzenstock"},{"$f":"LaPeKa!B9","v":"TG LaPeKa"},{"$f":"LaPeKa!AB9","v":64.7},null,200]
[13,{"$f":"LaPeKa!A17","v":"Bennett Hasenfuß"},{"$f":"LaPeKa!B17","v":"TG LaPeKa"},{"$f":"LaPeKa!AB17","v":62.649999999999991},null,200,null,null,null,null,null,null," "]
[14,{"$f":"Boffzen!A19","v":"Benedikt Sievers"},{"$f":"Boffzen!B19","v":"MTV Boffzen e.V. von 1892"},{"$f":"Boffzen!AB19","v":61.750000000000007},null,200]
[15,{"$f":"LaPeKa!A13","v":"Maxim Borgardt"},{"$f":"LaPeKa!B13","v":"TG LaPeKa"},{"$f":"LaPeKa!AB13","v":60.95},null,200]
[16,{"$f":"Boffzen!A17","v":"Nico Schilcher"},{"$f":"Boffzen!B17","v":"MTV Boffzen e.V. von 1892"},{"$f":"Boffzen!AB17","v":60.45},null,200]
[17,{"$f":"LaPeKa!A15","v":"Maxim Nuss"},{"$f":"LaPeKa!B15","v":"TG LaPeKa"},{"$f":"LaPeKa!AB15","v":52.400000000000006},null,200]
[18,{"$f":"Dielmissen!A17","v":"Joel Holzkamp"},{"$f":"Dielmissen!B17","v":"TSV Dielmissen"},{"$f":"Dielmissen!AB17","v":51.699999999999996},null,200]
[19,{"$f":"Boffzen!A13","v":"Robin Meisner"},{"$f":"Boffzen!B13","v":"MTV Boffzen e.V. von 1892"},{"$f":"Boffzen!AB13","v":35.4},null,200]
[20,{"$f":"Boffzen!A23","v":"Simon Janzen"},{"$f":"Boffzen!B23","v":"MTV Boffzen e.V. von 1892"},{"$f":"Boffzen!AB23","v":22.9},null,200]
[2001,{"$f":"'TG Oker_Salzg_Wenzen'!A9","v":"Ian Sureshkumar"},{"$f":"'TG Oker_Salzg_Wenzen'!B9","v":"TG Oker/Salzgitter/Wenzen"},{"$f":"'TG Oker_Salzg_Wenzen'!AB9","v":0},null,200]
[2001,{"$f":"'M5'!A19","v":"frei 6"},{"$f":"'M5'!B19","v":"M5"},{"$f":"'M5'!AB19","v":0},null,200]
[2001,{"$f":"LaPeKa!A11","v":"Til Mittag"},{"$f":"LaPeKa!B11","v":"TG LaPeKa"},{"$f":"LaPeKa!AB11","v":0},null,200]
[2001,{"$f":"Boffzen!A9","v":"Tom Esau"},{"$f":"Boffzen!B9","v":"MTV Boffzen e.V. von 1892"},{"$f":"Boffzen!AB9","v":0},null,200]
[2001,{"$f":"LaPeKa!A21","v":"frei 7"},{"$f":"LaPeKa!B21","v":"TG LaPeKa"},{"$f":"LaPeKa!AB21","v":0},null,200,null,null,{"$f":"I7","v":"Einsteigerliga"},null,{"$f":"K7","v":"Hehlen"},null,{"$f":"M7","v":"2019-02-16"}]
[2001,{"$f":"'M5'!A17","v":"frei 5"},{"$f":"'M5'!B17","v":"M5"},{"$f":"'M5'!AB17","v":0},null,200]
[2001,{"$f":"'M5'!A9","v":"frei 1"},{"$f":"'M5'!B9","v":"M5"},{"$f":"'M5'!AB9","v":0},null,200,null,null,"Ergebnis nach dem ",null,{"$f":"'INFO Blatt'!B9","v":"1."}," Wettkampftag"]
[2001,{"$f":"Dielmissen!A21","v":"frei 7"},{"$f":"Dielmissen!B21","v":""},{"$f":"Dielmissen!AB21","v":0},null,200,null,null,"Platz","Verein","WK Punkte","Gerät Punkt","Punkte"]
[2001,{"$f":"'TG Oker_Salzg_Wenzen'!A19","v":"Mattis Westermann"},{"$f":"'TG Oker_Salzg_Wenzen'!B19","v":"TG Oker/Salzgitter/Wenzen"},{"$f":"'TG Oker_Salzg_Wenzen'!AB19","v":0},null,200,null,null,{"$f":"Formeln!H6","v":1},{"$f":"Formeln!G6","v":"TG Oker/Salzgitter/Wenzen"},{"$f":"Formeln!I6","v":12},{"$f":"Formeln!J6","v":70},{"$f":"Formeln!K6","v":251.55}]
[2001,{"$f":"Dielmissen!A19","v":0},{"$f":"Dielmissen!B19","v":""},{"$f":"Dielmissen!AB19","v":0},null,200,null,null,{"$f":"Formeln!H8","v":2},{"$f":"Formeln!G8","v":"TSV Dielmissen"},{"$f":"Formeln!I8","v":10},{"$f":"Formeln!J8","v":56},{"$f":"Formeln!K8","v":231.14999999999998}]
[2001,{"$f":"'TG Oker_Salzg_Wenzen'!A21","v":"Felix Neuhoff"},{"$f":"'TG Oker_Salzg_Wenzen'!B21","v":"TG Oker/Salzgitter/Wenzen"},{"$f":"'TG Oker_Salzg_Wenzen'!AB21","v":0},null,200,null,null,{"$f":"Formeln!H5","v":3},{"$f":"Formeln!G5","v":"MTV Boffzen e.V. von 1892"},{"$f":"Formeln!I5","v":8},{"$f":"Formeln!J5","v":52},{"$f":"Formeln!K5","v":227.95000000000002}]
[2001,{"$f":"'M5'!A11","v":"frei 2"},{"$f":"'M5'!B11","v":"M5"},{"$f":"'M5'!AB11","v":0},null,200,null,null,{"$f":"Formeln!H7","v":4},{"$f":"Formeln!G7","v":"TG LaPeKa"},{"$f":"Formeln!I7","v":6},{"$f":"Formeln!J7","v":38},{"$f":"Formeln!K7","v":197.60000000000002}]
[{"$f":"IF(D44=0,F44*10+1,RANK(D44,D$12:D$101,0))","v":2001},{"$f":"'TG Oker_Salzg_Wenzen'!A11","v":"Rayan Hijazi"},{"$f":"'TG Oker_Salzg_Wenzen'!B11","v":"TG Oker/Salzgitter/Wenzen"},{"$f":"'TG Oker_Salzg_Wenzen'!AB11","v":0},null,200,null,null,{"$f":"Formeln!H9","v":6},{"$f":"Formeln!G9","v":"M5"},{"$f":"Formeln!I9","v":2},{"$f":"Formeln!J9","v":0},{"$f":"Formeln!K9","v":0}]
[2001,{"$f":"'M5'!A21","v":"frei 7"},{"$f":"'M5'!B21","v":"M5"},{"$f":"'M5'!AB21","v":0},null,200,null,null,{"$f":"Formeln!H10","v":6},{"$f":"Formeln!G10","v":"M6"},{"$f":"Formeln!I10","v":2},{"$f":"Formeln!J10","v":0},{"$f":"Formeln!K10","v":0}]
[2001,{"$f":"'M5'!A13","v":"frei 3"},{"$f":"'M5'!B13","v":"M5"},{"$f":"'M5'!AB13","v":0}," ",200,null,null,{"$f":"Formeln!H11","v":6},{"$f":"Formeln!G11","v":"M7"},{"$f":"Formeln!I11","v":2},{"$f":"Formeln!J11","v":0},{"$f":"Formeln!K11","v":0}]
[2001,{"$f":"Boffzen!A25","v":"frei 9"},{"$f":"Boffzen!B25","v":"MTV Boffzen e.V. von 1892"},{"$f":"Boffzen!AB25","v":0},null,200]
[2001,{"$f":"Boffzen!A37","v":"frei 15"},{"$f":"Boffzen!B37","v":"MTV Boffzen e.V. von 1892"},{"$f":"Boffzen!AB37","v":0},null,200]
[2001,{"$f":"'TG Oker_Salzg_Wenzen'!A23","v":"frei 8"},{"$f":"'TG Oker_Salzg_Wenzen'!B23","v":"TG Oker/Salzgitter/Wenzen"},{"$f":"'TG Oker_Salzg_Wenzen'!AB23","v":0},null,200]
[2001,{"$f":"'TG Oker_Salzg_Wenzen'!A25","v":"frei 9"},{"$f":"'TG Oker_Salzg_Wenzen'!B25","v":"TG Oker/Salzgitter/Wenzen"},{"$f":"'TG Oker_Salzg_Wenzen'!AB25","v":0},null,200]
[2001,{"$f":"'TG Oker_Salzg_Wenzen'!A27","v":"frei 10"},{"$f":"'TG Oker_Salzg_Wenzen'!B27","v":"TG Oker/Salzgitter/Wenzen"},{"$f":"'TG Oker_Salzg_Wenzen'!AB27","v":0},null,200]
[2001,{"$f":"'TG Oker_Salzg_Wenzen'!A37","v":"frei 15"},{"$f":"'TG Oker_Salzg_Wenzen'!B37","v":"TG Oker/Salzgitter/Wenzen"},{"$f":"'TG Oker_Salzg_Wenzen'!AB37","v":0},null,200]
[2001,{"$f":"Dielmissen!A23","v":"frei 8"},{"$f":"Dielmissen!B23","v":""},{"$f":"Dielmissen!AB23","v":0},null,200]
[2001,{"$f":"Dielmissen!A25","v":"frei 9"},{"$f":"Dielmissen!B25","v":""},{"$f":"Dielmissen!AB25","v":0},null,200]
[2001,{"$f":"Dielmissen!A27","v":"frei 10"},{"$f":"Dielmissen!B27","v":""},{"$f":"Dielmissen!AB27","v":0},null,200]
[2001,{"$f":"Dielmissen!A37","v":"frei 15"},{"$f":"Dielmissen!B37","v":""},{"$f":"Dielmissen!AB37","v":0},null,200]
[2001,{"$f":"'M6'!A37","v":"frei 15"},{"$f":"'M6'!B37","v":"M6"},{"$f":"'M6'!AB37","v":0},null,200]
[2001,{"$f":"'M6'!A15","v":"frei 4"},{"$f":"'M6'!B15","v":"M6"},{"$f":"'M6'!AB15","v":0},null,200]
[2001,{"$f":"'M6'!A17","v":"frei 5"},{"$f":"'M6'!B17","v":"M6"},{"$f":"'M6'!AB17","v":0},null,200]
[2001,{"$f":"'M6'!A11","v":"frei 2"},{"$f":"'M6'!B11","v":"M6"},{"$f":"'M6'!AB11","v":0},null,200]
[2001,{"$f":"'M6'!A13","v":"frei 3"},{"$f":"'M6'!B13","v":"M6"},{"$f":"'M6'!AB13","v":0},null,200]
[2001,{"$f":"'M6'!A27","v":"frei 10"},{"$f":"'M6'!B27","v":"M6"},{"$f":"'M6'!AB27","v":0},null,200]
[2001,{"$f":"'M6'!A35","v":"frei 14"},{"$f":"'M6'!B35","v":"M6"},{"$f":"'M6'!AB35","v":0},null,200]
[2001,{"$f":"'M6'!A9","v":"frei 1"},{"$f":"'M6'!B9","v":"M6"},{"$f":"'M6'!AB9","v":0},null,200]
[2001,{"$f":"Boffzen!A35","v":"frei 14"},{"$f":"Boffzen!B35","v":"MTV Boffzen e.V. von 1892"},{"$f":"Boffzen!AB35","v":0},null,200]
[2001,{"$f":"'TG Oker_Salzg_Wenzen'!A35","v":"frei 14"},{"$f":"'TG Oker_Salzg_Wenzen'!B35","v":"TG Oker/Salzgitter/Wenzen"},{"$f":"'TG Oker_Salzg_Wenzen'!AB35","v":0},null,200]
[2001,{"$f":"Boffzen!A33","v":"frei 13"},{"$f":"Boffzen!B33","v":"MTV Boffzen e.V. von 1892"},{"$f":"Boffzen!AB33","v":0},null,200]
[2001,{"$f":"'TG Oker_Salzg_Wenzen'!A33","v":"frei 13"},{"$f":"'TG Oker_Salzg_Wenzen'!B33","v":"TG Oker/Salzgitter/Wenzen"},{"$f":"'TG Oker_Salzg_Wenzen'!AB33","v":0},null,200]
[2001,{"$f":"Boffzen!A31","v":"frei 12"},{"$f":"Boffzen!B31","v":"MTV Boffzen e.V. von 1892"},{"$f":"Boffzen!AB31","v":0},null,200]
[2001,{"$f":"'TG Oker_Salzg_Wenzen'!A31","v":"frei 12"},{"$f":"'TG Oker_Salzg_Wenzen'!B31","v":"TG Oker/Salzgitter/Wenzen"},{"$f":"'TG Oker_Salzg_Wenzen'!AB31","v":0},null,200]
[2001,{"$f":"'TG Oker_Salzg_Wenzen'!A29","v":"frei 11"},{"$f":"'TG Oker_Salzg_Wenzen'!B29","v":"TG Oker/Salzgitter/Wenzen"},{"$f":"'TG Oker_Salzg_Wenzen'!AB29","v":0},null,200]
[2001,{"$f":"Dielmissen!A29","v":"frei 11"},{"$f":"Dielmissen!B29","v":""},{"$f":"Dielmissen!AB29","v":0},null,200]
[2001,{"$f":"Dielmissen!A35","v":"frei 14"},{"$f":"Dielmissen!B35","v":""},{"$f":"Dielmissen!AB35","v":0},null,200]
[2001,{"$f":"Boffzen!A29","v":"frei 11"},{"$f":"Boffzen!B29","v":"MTV Boffzen e.V. von 1892"},{"$f":"Boffzen!AB29","v":0},null,200]
[2001,{"$f":"LaPeKa!A27","v":"frei 10"},{"$f":"LaPeKa!B27","v":"TG LaPeKa"},{"$f":"LaPeKa!AB27","v":0},null,200]
[{"$f":"IF(D76=0,F76*10+1,RANK(D76,D$12:D$101,0))","v":2001},{"$f":"Dielmissen!A33","v":"frei 13"},{"$f":"Dielmissen!B33","v":""},{"$f":"Dielmissen!AB33","v":0},null,200]
[2001,{"$f":"LaPeKa!A25","v":"frei 9"},{"$f":"LaPeKa!B25","v":"TG LaPeKa"},{"$f":"LaPeKa!AB25","v":0},null,200]
[2001,{"$f":"LaPeKa!A23","v":"frei 8"},{"$f":"LaPeKa!B23","v":"TG LaPeKa"},{"$f":"LaPeKa!AB23","v":0},null,200]
[2001,{"$f":"'M6'!A33","v":"frei 13"},{"$f":"'M6'!B33","v":"M6"},{"$f":"'M6'!AB33","v":0},null,200]
[2001,{"$f":"'M6'!A31","v":"frei 12"},{"$f":"'M6'!B31","v":"M6"},{"$f":"'M6'!AB31","v":0},null,{"$f":"F79","v":200}]
[2001,{"$f":"'M6'!A29","v":"frei 11"},{"$f":"'M6'!B29","v":"M6"},{"$f":"'M6'!AB29","v":0},null,200]
[2001,{"$f":"'M6'!A25","v":"frei 9"},{"$f":"'M6'!B25","v":"M6"},{"$f":"'M6'!AB25","v":0},null,200]
[2001,{"$f":"'M6'!A23","v":"frei 8"},{"$f":"'M6'!B23","v":"M6"},{"$f":"'M6'!AB23","v":0},null,200]
[2001,{"$f":"Dielmissen!A31","v":"frei 12"},{"$f":"Dielmissen!B31","v":""},{"$f":"Dielmissen!AB31","v":0},null,200]
[2001,{"$f":"'M6'!A19","v":"frei 6"},{"$f":"'M6'!B19","v":"M6"},{"$f":"'M6'!AB19","v":0},null,200]
[2001,{"$f":"'M6'!A21","v":"frei 7"},{"$f":"'M6'!B21","v":"M6"},{"$f":"'M6'!AB21","v":0},null,200]
[2001,{"$f":"Boffzen!A27","v":"frei 10"},{"$f":"Boffzen!B27","v":"MTV Boffzen e.V. von 1892"},{"$f":"Boffzen!AB27","v":0},null,200]
[2001,{"$f":"'M5'!A23","v":"frei 8"},{"$f":"'M5'!B23","v":"M5"},{"$f":"'M5'!AB23","v":0},null,200]
[2001,{"$f":"'M5'!A15","v":"frei 4"},{"$f":"'M5'!B15","v":"M5"},{"$f":"'M5'!AB15","v":0},null,200]
[2001,{"$f":"'M5'!A25","v":"frei 9"},{"$f":"'M5'!B25","v":"M5"},{"$f":"'M5'!AB25","v":0},null,200]
[2001,{"$f":"'M5'!A27","v":"frei 10"},{"$f":"'M5'!B27","v":"M5"},{"$f":"'M5'!AB27","v":0},null,200]
[2001,{"$f":"'M5'!A29","v":"frei 11"},{"$f":"'M5'!B29","v":"M5"},{"$f":"'M5'!AB29","v":0},null,200]
[2001,{"$f":"'M5'!A31","v":"frei 12"},{"$f":"'M5'!B31","v":"M5"},{"$f":"'M5'!AB31","v":0},null,200]
[2001,{"$f":"'M5'!A33","v":"frei 13"},{"$f":"'M5'!B33","v":"M5"},{"$f":"'M5'!AB33","v":0},null,200]
[2001,{"$f":"'M5'!A35","v":"frei 14"},{"$f":"'M5'!B35","v":"M5"},{"$f":"'M5'!AB35","v":0},null,200]
[2001,{"$f":"'M5'!A37","v":"frei 15"},{"$f":"'M5'!B37","v":"M5"},{"$f":"'M5'!AB37","v":0},null,200]
[2001,{"$f":"LaPeKa!A29","v":"frei 11"},{"$f":"LaPeKa!B29","v":"TG LaPeKa"},{"$f":"LaPeKa!AB29","v":0},null,200]
[2001,{"$f":"LaPeKa!A31","v":"frei 12"},{"$f":"LaPeKa!B31","v":"TG LaPeKa"},{"$f":"LaPeKa!AB31","v":0},null,200]
[2001,{"$f":"LaPeKa!A33","v":"frei 13"},{"$f":"LaPeKa!B33","v":"TG LaPeKa"},{"$f":"LaPeKa!AB33","v":0},null,200]
[2001,{"$f":"LaPeKa!A35","v":"frei 14"},{"$f":"LaPeKa!B35","v":"TG LaPeKa"},{"$f":"LaPeKa!AB35","v":0},null,200]
[2001,{"$f":"LaPeKa!A37","v":"frei 15"},{"$f":"LaPeKa!B37","v":"TG LaPeKa"},{"$f":"LaPeKa!AB37","v":0},null,200]
[]
[]
[]
[]
[]
[null,null,null,null,null,{"$f":"B106","v":0}]
[null,null,null,null,null,{"$f":"F107","v":0}]
[null,null,null,null,null,0]
[null,null,null,null,null,0]
[null,null,null,null,null,0]
[null,null,null,null,null,0]
[null,null,null,null,null,0]
[null,null,null,null,null,0]

{"sheet":"Startreihenfolge","index":2,"n_rows":88,"n_cols":6,"rows_kept":88,"cut":false,"hidden":false,"merged":[]}
[]
[null,"1. Runde"]
[]
[null,"Boden",null,"Pauschenpferd",null,"Ringe"]
[]
[null,{"$f":"Ergebnisse!J41","v":"TSV Dielmissen"},null,{"$f":"Ergebnisse!J43","v":"TG LaPeKa"},null,{"$f":"Ergebnisse!J45","v":"M6"}]
[null,{"$f":"Ergebnisse!J42","v":"MTV Boffzen e.V. von 1892"},null,{"$f":"Ergebnisse!J44","v":"M5"},null,{"$f":"Ergebnisse!J46","v":"M7"}]
[]
[]
[null,"Sprung",null,"Barren",null,"Reck"]
[]
[null,{"$f":"[1]Ergebnisse!$J$40","v":"TV Kleefeld 1"},null,{"$f":"[1]Ergebnisse!$J$42","v":"SC Melle"},null,{"$f":"[1]Ergebnisse!$J$44","v":"TG Braunschweig -Hondelage"}]
[null,{"$f":"[1]Ergebnisse!$J$41","v":"1860 Bremen"},null,{"$f":"[1]Ergebnisse!$J$43","v":"TG Oker Salzgitter 2"},null,{"$f":"[1]Ergebnisse!$J$45","v":"TG Rinteln - Hehlen 1"}]
[]
[]
[]
[null,"2. Runde"]
[]
[null,"Boden",null,"Pauschenpferd",null,"Ringe"]
[]
[null,{"$f":"F7","v":"M7"},null,{"$f":"B7","v":"MTV Boffzen e.V. von 1892"},null,{"$f":"D7","v":"M5"}]
[null,{"$f":"F6","v":"M6"},null,{"$f":"B6","v":"TSV Dielmissen"},null,{"$f":"D6","v":"TG LaPeKa"}]
[]
[]
[null,"Sprung",null,"Barren",null,"Reck"]
[]
[null,{"$f":"F13","v":"TG Rinteln - Hehlen 1"},null,{"$f":"B13","v":"1860 Bremen"},null,{"$f":"D13","v":"TG Oker Salzgitter 2"}]
[null,{"$f":"F12","v":"TG Braunschweig -Hondelage"},null,{"$f":"B12","v":"TV Kleefeld 1"},null,{"$f":"D12","v":"SC Melle"}]
[]
[]
[]
[null,"3. Runde"]
[]
[null,"Boden",null,"Pauschenpferd",null,"Ringe"]
[]
[null,{"$f":"F22","v":"TG LaPeKa"},null,{"$f":"B22","v":"M6"},null,{"$f":"D22","v":"TSV Dielmissen"}]
[null,{"$f":"F21","v":"M5"},null,{"$f":"B21","v":"M7"},null,{"$f":"D21","v":"MTV Boffzen e.V. von 1892"}]
[]
[]
[null,"Sprung",null,"Barren",null,"Reck"]
[]
[null,{"$f":"F28","v":"SC Melle"},null,{"$f":"B28","v":"TG Braunschweig -Hondelage"},null,{"$f":"D28","v":"TV Kleefeld 1"}]
[null,{"$f":"F27","v":"TG Oker Salzgitter 2"},null,{"$f":"B27","v":"TG Rinteln - Hehlen 1"},null,{"$f":"D27","v":"1860 Bremen"}]
[]
[]
[]
[null,"4. Runde"]
[]
[null,"Boden",null,"Pauschenpferd",null,"Ringe"]
[]
[null,{"$f":"F43","v":"1860 Bremen"},null,{"$f":"B43","v":"TG Oker Salzgitter 2"},null,{"$f":"D43","v":"TG Rinteln - Hehlen 1"}]
[null,{"$f":"F42","v":"TV Kleefeld 1"},null,{"$f":"B42","v":"SC Melle"},null,{"$f":"D42","v":"TG Braunschweig -Hondelage"}]
[]
[]
[null,"Sprung",null,"Barren",null,"Reck"]
[]
[null,{"$f":"F37","v":"MTV Boffzen e.V. von 1892"},null,{"$f":"B37","v":"M5"},null,{"$f":"D37","v":"M7"}]
[null,{"$f":"F36","v":"TSV Dielmissen"},null,{"$f":"B36","v":"TG LaPeKa"},null,{"$f":"D36","v":"M6"}]
[]
[]
[]
[null,"5. Runde"]
[]
[null,"Boden",null,"Pauschenpferd",null,"Ringe"]
[]
[null,{"$f":"F52","v":"TG Braunschweig -Hondelage"},null,{"$f":"B52","v":"TV Kleefeld 1"},null,{"$f":"D52","v":"SC Melle"}]
[null,{"$f":"F51","v":"TG Rinteln - Hehlen 1"},null,{"$f":"B51","v":"1860 Bremen"},null,{"$f":"D51","v":"TG Oker Salzgitter 2"}]
[]
[]
[null,"Sprung",null,"Barren",null,"Reck"]
[]
[null,{"$f":"F58","v":"M6"},null,{"$f":"B58","v":"TSV Dielmissen"},null,{"$f":"D58","v":"TG LaPeKa"}]
[null,{"$f":"F57","v":"M7"},null,{"$f":"B57","v":"MTV Boffzen e.V. von 1892"},null,{"$f":"D57","v":"M5"}]
[]
[]
[]
[null,"6. Runde"]
[]
[null,"Boden",null,"Pauschenpferd",null,"Ringe"]
[]
[null,{"$f":"F67","v":"TG Oker Salzgitter 2"},null,{"$f":"B67","v":"TG Rinteln - Hehlen 1"},null,{"$f":"D67","v":"1860 Bremen"}]
[null,{"$f":"F66","v":"SC Melle"},null,{"$f":"B66","v":"TG Braunschweig -Hondelage"},null,{"$f":"D66","v":"TV Kleefeld 1"}]
[]
[]
[null,"Sprung",null,"Barren",null,"Reck"]
[]
[null,{"$f":"F73","v":"M5"},null,{"$f":"B73","v":"M7"},null,{"$f":"D73","v":"MTV Boffzen e.V. von 1892"}]
[null,{"$f":"F72","v":"TG LaPeKa"},null,{"$f":"B72","v":"M6"},null,{"$f":"D72","v":"TSV Dielmissen"}]

{"sheet":"Formeln","index":3,"n_rows":42,"n_cols":15,"rows_kept":42,"cut":false,"hidden":false,"merged":[]}
[]
[]
["Gesamt",null,null,null,null,null,"Gesamt 1. WK"]
[null,"Punkte","Platz","WK Punkte","Gerät Punkt",null,null,"Platz","WK Punkte","Gerät Punkt","Punkte","Rang WK","Rang Geräte","Rang Punkte","Hilfsliste"]
["MTV Boffzen e.V. von 1892",{"$f":"Boffzen!AB$40","v":227.95000000000002},{"$f":"IF(B5=0,'INFO Blatt'!B$3+1,RANK(B5,B$5:B$14,0))","v":3},{"$f":"IF('INFO Blatt'!B$3<6,14-C5*2,'INFO Blatt'!B$3*2+2-C5*2)","v":8},{"$f":"SUM(D20,I20,N20,D33,I33,N33)","v":52},null,{"$f":"A5","v":"MTV Boffzen e.V. von 1892"},{"$f":"IF(K5=0,'INFO Blatt'!B$3+1,RANK(O5,O$5:O$14,1))","v":3},{"$f":"D5","v":8},{"$f":"E5","v":52},{"$f":"B5","v":227.95000000000002},{"$f":"RANK(I5,I5:I14,0)","v":3},{"$f":"RANK(J5,J5:J14,0)","v":3},{"$f":"RANK(K5,K$5:K$14,0)","v":3},{"$f":"L5+(M5/10)+(N5/100)","v":3.3299999999999996}]
["TG Oker/Salzgitter/Wenzen",{"$f":"'TG Oker_Salzg_Wenzen'!AB$40","v":251.55},{"$f":"IF(B6=0,'INFO Blatt'!B$3+1,RANK(B6,B$5:B$14,0))","v":1},{"$f":"IF('INFO Blatt'!B$3<6,14-C6*2,'INFO Blatt'!B$3*2+2-C6*2)","v":12},70,null,{"$f":"A6","v":"TG Oker/Salzgitter/Wenzen"},{"$f":"IF(K6=0,'INFO Blatt'!B$3+1,RANK(O6,O$5:O$14,1))","v":1},{"$f":"D6","v":12},{"$f":"E6","v":70},{"$f":"B6","v":251.55},{"$f":"RANK(I6,I5:I14,0)","v":1},{"$f":"RANK(J6,J5:J14,0)","v":1},{"$f":"RANK(K6,K$5:K$14,0)","v":1},{"$f":"L6+(M6/10)+(N6/100)","v":1.1100000000000001}]
["TG LaPeKa",{"$f":"LaPeKa!AB$40","v":197.60000000000002},{"$f":"IF(B7=0,'INFO Blatt'!B$3+1,RANK(B7,B$5:B$14,0))","v":4},{"$f":"IF('INFO Blatt'!B$3<6,14-C7*2,'INFO Blatt'!B$3*2+2-C7*2)","v":6},38,null,"TG LaPeKa",{"$f":"IF(K7=0,'INFO Blatt'!B$3+1,RANK(O7,O$5:O$14,1))","v":4},6,38,197.60000000000002,{"$f":"RANK(I7,I5:I14,0)","v":4},{"$f":"RANK(J7,J5:J14,0)","v":4},4,4.4400000000000004]
["TSV Dielmissen",{"$f":"Dielmissen!AB$40","v":231.14999999999998},{"$f":"IF(B8=0,'INFO Blatt'!B$3+1,RANK(B8,B$5:B$14,0))","v":2},{"$f":"IF('INFO Blatt'!B$3<6,14-C8*2,'INFO Blatt'!B$3*2+2-C8*2)","v":10},56,null,"TSV Dielmissen",{"$f":"IF(K8=0,'INFO Blatt'!B$3+1,RANK(O8,O$5:O$14,1))","v":2},10,56,231.14999999999998,{"$f":"RANK(I8,I5:I14,0)","v":2},{"$f":"RANK(J8,J5:J14,0)","v":2},2,2.2200000000000002]
["M5",{"$f":"'M5'!AB$40","v":0},{"$f":"IF(B9=0,'INFO Blatt'!B$3+1,RANK(B9,B$5:B$14,0))","v":6},{"$f":"IF('INFO Blatt'!B$3<6,14-C9*2,'INFO Blatt'!B$3*2+2-C9*2)","v":2},0,null,"M5",{"$f":"IF(K9=0,'INFO Blatt'!B$3+1,RANK(O9,O$5:O$14,1))","v":6},2,0,0,{"$f":"RANK(I9,I5:I14,0)","v":5},{"$f":"RANK(J9,J5:J14,0)","v":5},5,5.55]
["M6",{"$f":"'M6'!AB$40","v":0},{"$f":"IF(B10=0,'INFO Blatt'!B$3+1,RANK(B10,B$5:B$14,0))","v":6},{"$f":"IF('INFO Blatt'!B$3<6,14-C10*2,'INFO Blatt'!B$3*2+2-C10*2)","v":2},0,null,"M6",{"$f":"IF(K10=0,'INFO Blatt'!B$3+1,RANK(O10,O$5:O$14,1))","v":6},2,0,0,{"$f":"RANK(I10,I5:I14,0)","v":5},{"$f":"RANK(J10,J5:J14,0)","v":5},5,5.55]
["M7",{"$f":"'M7'!AB$30","v":0},{"$f":"IF(B11=0,'INFO Blatt'!B$3+1,RANK(B11,B$5:B$14,0))","v":6},{"$f":"IF('INFO Blatt'!B$3<6,14-C11*2,'INFO Blatt'!B$3*2+2-C11*2)","v":2},0,null,"M7",{"$f":"IF(K11=0,'INFO Blatt'!B$3+1,RANK(O11,O$5:O$14,1))","v":6},{"$f":"D11+[2]Formeln!$I11","v":2},{"$f":"E11+[2]Formeln!$J11","v":0},{"$f":"B11+[2]Formeln!$K11","v":0},{"$f":"RANK(I11,I5:I14,0)","v":5},{"$f":"RANK(J11,J5:J14,0)","v":5},5,5.55]
["M8",{"$f":"'M8'!AB$30","v":0},{"$f":"IF(B12=0,'INFO Blatt'!B$3+1,RANK(B12,B$5:B$14,0))","v":6},{"$f":"IF('INFO Blatt'!B$3<6,14-C12*2,'INFO Blatt'!B$3*2+2-C12*2)","v":2},0,null,"M8",{"$f":"IF(K12=0,'INFO Blatt'!B$3+1,RANK(O12,O$5:O$14,1))","v":6},{"$f":"D12+[2]Formeln!$I12","v":2},{"$f":"E12+[2]Formeln!$J12","v":0},{"$f":"B12+[2]Formeln!$K12","v":0},{"$f":"RANK(I12,I5:I14,0)","v":5},{"$f":"RANK(J12,J5:J14,0)","v":5},5,5.55]
["M9",{"$f":"'M9'!AB$30","v":0},{"$f":"IF(B13=0,'INFO Blatt'!B$3+1,RANK(B13,B$5:B$14,0))","v":6},{"$f":"IF('INFO Blatt'!B$3<6,14-C13*2,'INFO Blatt'!B$3*2+2-C13*2)","v":2},0,null,"M9",{"$f":"IF(K13=0,'INFO Blatt'!B$3+1,RANK(O13,O$5:O$14,1))","v":6},{"$f":"D13+[2]Formeln!$I13","v":2},{"$f":"E13+[2]Formeln!$J13","v":0},{"$f":"B13+[2]Formeln!$K13","v":0},{"$f":"RANK(I13,I5:I14,0)","v":5},{"$f":"RANK(J13,J5:J14,0)","v":5},5,5.55]
["M10",{"$f":"'M10'!AB$30","v":0},{"$f":"IF(B14=0,'INFO Blatt'!B$3+1,RANK(B14,B$5:B$14,0))","v":6},{"$f":"IF('INFO Blatt'!B$3<6,14-C14*2,'INFO Blatt'!B$3*2+2-C14*2)","v":2},0,null,"M10",{"$f":"IF(K14=0,'INFO Blatt'!B$3+1,RANK(O14,O$5:O$14,1))","v":6},{"$f":"D14+[2]Formeln!$I14","v":2},{"$f":"E14+[2]Formeln!$J14","v":0},{"$f":"B14+[2]Formeln!$K14","v":0},{"$f":"RANK(I14,I5:I14,0)","v":5},{"$f":"RANK(J14,J5:J14,0)","v":5},5,5.55]
[]
["Gerätepunkte"]
[]
["Boden",null,null,null,null,"Pferd",null,null,null,null,"Ringe"]
[null,"Punkte","Platz","Gerät Punkt",null,null,"Punkte","Platz","Gerät Punkt",null,null,"Punkte","Platz","Gerät Punkt"]
[{"$f":"A5","v":"MTV Boffzen e.V. von 1892"},{"$f":"ROUND(Boffzen!$G$40,2)","v":35.15},{"$f":"IF(B20=0,,RANK(B20,B$20:B$29,0))","v":3},{"$f":"IF(C20=0,,IF('INFO Blatt'!B$3<6,14-C20*2,'INFO Blatt'!B$3*2+2-C20*2))","v":8},null,{"$f":"A5","v":"MTV Boffzen e.V. von 1892"},{"$f":"ROUND(Boffzen!$K$40,2)","v":35.9},{"$f":"IF(G20=0,,RANK(G20,G$20:G$29,0))","v":2},{"$f":"IF(H20=0,,IF('INFO Blatt'!B$3<6,14-H20*2,'INFO Blatt'!B$3*2+2-H20*2))","v":10},null,{"$f":"A5","v":"MTV Boffzen e.V. von 1892"},{"$f":"ROUND(Boffzen!$O$40,2)","v":39},{"$f":"IF(L20=0,,RANK(L20,L$20:L$29,0))","v":2},{"$f":"IF(M20=0,,IF('INFO Blatt'!B$3<6,14-M20*2,'INFO Blatt'!B$3*2+2-M20*2))","v":10}]
["TG Oker/Salzgitter/Wenzen",{"$f":"ROUND('TG Oker_Salzg_Wenzen'!G40,2)","v":37.799999999999997},2,{"$f":"IF(C21=0,,IF('INFO Blatt'!B$3<6,14-C21*2,'INFO Blatt'!B$3*2+2-C21*2))","v":10},null,"TG Oker/Salzgitter/Wenzen",{"$f":"ROUND('TG Oker_Salzg_Wenzen'!K40,2)","v":40.799999999999997},1,{"$f":"IF(H21=0,,IF('INFO Blatt'!B$3<6,14-H21*2,'INFO Blatt'!B$3*2+2-H21*2))","v":12},null,"TG Oker/Salzgitter/Wenzen",{"$f":"ROUND('TG Oker_Salzg_Wenzen'!O40,2)","v":41.8},{"$f":"IF(L21=0,,RANK(L21,L$20:L$29,0))","v":1},{"$f":"IF(M21=0,,IF('INFO Blatt'!B$3<6,14-M21*2,'INFO Blatt'!B$3*2+2-M21*2))","v":12}]
["TG LaPeKa",{"$f":"ROUND(LaPeKa!$G$40,2)","v":32.450000000000003},4,{"$f":"IF(C22=0,,IF('INFO Blatt'!B$3<6,14-C22*2,'INFO Blatt'!B$3*2+2-C22*2))","v":6},null,"TG LaPeKa",{"$f":"ROUND(LaPeKa!$K$40,2)","v":31.7},3,{"$f":"IF(H22=0,,IF('INFO Blatt'!B$3<6,14-H22*2,'INFO Blatt'!B$3*2+2-H22*2))","v":8},null,"TG LaPeKa",{"$f":"ROUND(LaPeKa!$O$40,2)","v":27.5},4,{"$f":"IF(M22=0,,IF('INFO Blatt'!B$3<6,14-M22*2,'INFO Blatt'!B$3*2+2-M22*2))","v":6}]
["TSV Dielmissen",{"$f":"ROUND(Dielmissen!$G$40,2)","v":40.1},1,{"$f":"IF(C23=0,,IF('INFO Blatt'!B$3<6,14-C23*2,'INFO Blatt'!B$3*2+2-C23*2))","v":12},null,"TSV Dielmissen",{"$f":"ROUND(Dielmissen!$K$40,2)","v":31},4,{"$f":"IF(H23=0,,IF('INFO Blatt'!B$3<6,14-H23*2,'INFO Blatt'!B$3*2+2-H23*2))","v":6},null,"TSV Dielmissen",{"$f":"ROUND(Dielmissen!$O$40,2)","v":38.1},3,{"$f":"IF(M23=0,,IF('INFO Blatt'!B$3<6,14-M23*2,'INFO Blatt'!B$3*2+2-M23*2))","v":8}]
["M5",{"$f":"ROUND('M5'!$G$40,2)","v":0},0,{"$f":"IF(C24=0,,IF('INFO Blatt'!B$3<6,14-C24*2,'INFO Blatt'!B$3*2+2-C24*2))","v":0},null,"M5",{"$f":"ROUND('M5'!$K$40,2)","v":0},0,{"$f":"IF(H24=0,,IF('INFO Blatt'!B$3<6,14-H24*2,'INFO Blatt'!B$3*2+2-H24*2))","v":0},null,"M5",{"$f":"ROUND('M5'!$O$40,2)","v":0},0,{"$f":"IF(M24=0,,IF('INFO Blatt'!B$3<6,14-M24*2,'INFO Blatt'!B$3*2+2-M24*2))","v":0}]
["M6",{"$f":"ROUND('M6'!$G$40,2)","v":0},0,{"$f":"IF(C25=0,,IF('INFO Blatt'!B$3<6,14-C25*2,'INFO Blatt'!B$3*2+2-C25*2))","v":0},null,"M6",{"$f":"ROUND('M6'!$K$40,2)","v":0},0,{"$f":"IF(H25=0,,IF('INFO Blatt'!B$3<6,14-H25*2,'INFO Blatt'!B$3*2+2-H25*2))","v":0},null,"M6",{"$f":"ROUND('M6'!$O$40,2)","v":0},0,{"$f":"IF(M25=0,,IF('INFO Blatt'!B$3<6,14-M25*2,'INFO Blatt'!B$3*2+2-M25*2))","v":0}]
["M7",{"$f":"ROUND('M7'!G30,2)","v":0},0,{"$f":"IF(C26=0,,IF('INFO Blatt'!B$3<6,14-C26*2,'INFO Blatt'!B$3*2+2-C26*2))","v":0},null,"M7",{"$f":"ROUND('M7'!K30,2)","v":0},0,{"$f":"IF(H26=0,,IF('INFO Blatt'!B$3<6,14-H26*2,'INFO Blatt'!B$3*2+2-H26*2))","v":0},null,"M7",{"$f":"ROUND('M7'!O30,2)","v":0},{"$f":"IF(L26=0,,RANK(L26,L$20:L$29,0))","v":0},{"$f":"IF(M26=0,,IF('INFO Blatt'!B$3<6,14-M26*2,'INFO Blatt'!B$3*2+2-M26*2))","v":0}]
["M8",{"$f":"'M8'!$G$30","v":0},0,{"$f":"IF(C27=0,,IF('INFO Blatt'!B$3<6,14-C27*2,'INFO Blatt'!B$3*2+2-C27*2))","v":0},null,"M8",{"$f":"'M8'!K$30","v":0},0,{"$f":"IF(H27=0,,IF('INFO Blatt'!B$3<6,14-H27*2,'INFO Blatt'!B$3*2+2-H27*2))","v":0},null,"M8",{"$f":"'M8'!O$30","v":0},0,{"$f":"IF(M27=0,,IF('INFO Blatt'!B$3<6,14-M27*2,'INFO Blatt'!B$3*2+2-M27*2))","v":0}]
["M9",{"$f":"'M9'!$G$30","v":0},0,{"$f":"IF(C28=0,,IF('INFO Blatt'!B$3<6,14-C28*2,'INFO Blatt'!B$3*2+2-C28*2))","v":0},null,"M9",{"$f":"'M9'!K$30","v":0},0,{"$f":"IF(H28=0,,IF('INFO Blatt'!B$3<6,14-H28*2,'INFO Blatt'!B$3*2+2-H28*2))","v":0},null,"M9",{"$f":"'M9'!O$30","v":0},0,{"$f":"IF(M28=0,,IF('INFO Blatt'!B$3<6,14-M28*2,'INFO Blatt'!B$3*2+2-M28*2))","v":0}]
["M10",{"$f":"'M10'!$G$30","v":0},0,{"$f":"IF(C29=0,,IF('INFO Blatt'!B$3<6,14-C29*2,'INFO Blatt'!B$3*2+2-C29*2))","v":0},null,"M10",{"$f":"'M10'!K$30","v":0},0,{"$f":"IF(H29=0,,IF('INFO Blatt'!B$3<6,14-H29*2,'INFO Blatt'!B$3*2+2-H29*2))","v":0},null,"M10",{"$f":"'M10'!O$30","v":0},0,{"$f":"IF(M29=0,,IF('INFO Blatt'!B$3<6,14-M29*2,'INFO Blatt'!B$3*2+2-M29*2))","v":0}]
[]
["Sprung",null,null,null,null,"Barren",null,null,null,null,"Reck"]
[null,"Punkte","Platz","Gerät Punkt",null,null,"Punkte","Platz","Gerät Punkt",null,null,"Punkte","Platz","Gerät Punkt"]
[{"$f":"A5","v":"MTV Boffzen e.V. von 1892"},{"$f":"ROUND(Boffzen!$S$40,2)","v":40.85},{"$f":"IF(B33=0,,RANK(B33,B$33:B$42,0))","v":3},{"$f":"IF(C33=0,,IF('INFO Blatt'!B$3<6,14-C33*2,'INFO Blatt'!B$3*2+2-C33*2))","v":8},null,{"$f":"A5","v":"MTV Boffzen e.V. von 1892"},{"$f":"ROUND(Boffzen!$W$40,2)","v":39.700000000000003},{"$f":"IF(G33=0,,RANK(G33,G$33:G$42,0))","v":3},{"$f":"IF(H33=0,,IF('INFO Blatt'!B$3<6,14-H33*2,'INFO Blatt'!B$3*2+2-H33*2))","v":8},null,{"$f":"A5","v":"MTV Boffzen e.V. von 1892"},{"$f":"ROUND(Boffzen!$AA$40,2)","v":37.35},{"$f":"IF(L33=0,,RANK(L33,L$33:L$42,0))","v":3},{"$f":"IF(M33=0,,IF('INFO Blatt'!B$3<6,14-M33*2,'INFO Blatt'!B$3*2+2-M33*2))","v":8}]
["TG Oker/Salzgitter/Wenzen",{"$f":"ROUND('TG Oker_Salzg_Wenzen'!S40,2)","v":44.4},1,{"$f":"IF(C34=0,,IF('INFO Blatt'!B$3<6,14-C34*2,'INFO Blatt'!B$3*2+2-C34*2))","v":12},null,"TG Oker/Salzgitter/Wenzen",{"$f":"ROUND('TG Oker_Salzg_Wenzen'!W40,2)","v":44.7},1,{"$f":"IF(H34=0,,IF('INFO Blatt'!B$3<6,14-H34*2,'INFO Blatt'!B$3*2+2-H34*2))","v":12},null,"TG Oker/Salzgitter/Wenzen",{"$f":"ROUND('TG Oker_Salzg_Wenzen'!AA40,2)","v":42.05},{"$f":"IF(L34=0,,RANK(L34,L$33:L$42,0))","v":1},{"$f":"IF(M34=0,,IF('INFO Blatt'!B$3<6,14-M34*2,'INFO Blatt'!B$3*2+2-M34*2))","v":12}]
["TG LaPeKa",{"$f":"ROUND(LaPeKa!$S$40,2)","v":39.4},4,{"$f":"IF(C35=0,,IF('INFO Blatt'!B$3<6,14-C35*2,'INFO Blatt'!B$3*2+2-C35*2))","v":6},null,"TG LaPeKa",{"$f":"ROUND(LaPeKa!$W$40,2)","v":34},4,{"$f":"IF(H35=0,,IF('INFO Blatt'!B$3<6,14-H35*2,'INFO Blatt'!B$3*2+2-H35*2))","v":6},null,"TG LaPeKa",{"$f":"ROUND(LaPeKa!$AA$40,2)","v":32.549999999999997},4,{"$f":"IF(M35=0,,IF('INFO Blatt'!B$3<6,14-M35*2,'INFO Blatt'!B$3*2+2-M35*2))","v":6}]
["TSV Dielmissen",{"$f":"ROUND(Dielmissen!$S$40,2)","v":41.7},2,{"$f":"IF(C36=0,,IF('INFO Blatt'!B$3<6,14-C36*2,'INFO Blatt'!B$3*2+2-C36*2))","v":10},null,"TSV Dielmissen",{"$f":"ROUND(Dielmissen!$W$40,2)","v":40.35},2,{"$f":"IF(H36=0,,IF('INFO Blatt'!B$3<6,14-H36*2,'INFO Blatt'!B$3*2+2-H36*2))","v":10},null,"TSV Dielmissen",{"$f":"ROUND(Dielmissen!$AA$40,2)","v":39.9},2,{"$f":"IF(M36=0,,IF('INFO Blatt'!B$3<6,14-M36*2,'INFO Blatt'!B$3*2+2-M36*2))","v":10}]
["M5",{"$f":"ROUND('M5'!$S$40,2)","v":0},0,{"$f":"IF(C37=0,,IF('INFO Blatt'!B$3<6,14-C37*2,'INFO Blatt'!B$3*2+2-C37*2))","v":0},null,"M5",{"$f":"ROUND('M5'!$W$40,2)","v":0},0,{"$f":"IF(H37=0,,IF('INFO Blatt'!B$3<6,14-H37*2,'INFO Blatt'!B$3*2+2-H37*2))","v":0},null,"M5",{"$f":"ROUND('M5'!$AA$40,2)","v":0},0,{"$f":"IF(M37=0,,IF('INFO Blatt'!B$3<6,14-M37*2,'INFO Blatt'!B$3*2+2-M37*2))","v":0}]
["M6",{"$f":"ROUND('M6'!$S$40,2)","v":0},0,{"$f":"IF(C38=0,,IF('INFO Blatt'!B$3<6,14-C38*2,'INFO Blatt'!B$3*2+2-C38*2))","v":0},null,"M6",{"$f":"ROUND('M6'!$W$40,2)","v":0},0,{"$f":"IF(H38=0,,IF('INFO Blatt'!B$3<6,14-H38*2,'INFO Blatt'!B$3*2+2-H38*2))","v":0},null,"M6",{"$f":"ROUND('M6'!$AA$40,2)","v":0},0,{"$f":"IF(M38=0,,IF('INFO Blatt'!B$3<6,14-M38*2,'INFO Blatt'!B$3*2+2-M38*2))","v":0}]
["M7",{"$f":"ROUND('M7'!S30,2)","v":0},0,{"$f":"IF(C39=0,,IF('INFO Blatt'!B$3<6,14-C39*2,'INFO Blatt'!B$3*2+2-C39*2))","v":0},null,"M7",{"$f":"ROUND('M7'!W30,2)","v":0},0,{"$f":"IF(H39=0,,IF('INFO Blatt'!B$3<6,14-H39*2,'INFO Blatt'!B$3*2+2-H39*2))","v":0},null,"M7",{"$f":"ROUND('M7'!AA30,2)","v":0},{"$f":"IF(L39=0,,RANK(L39,L$33:L$42,0))","v":0},{"$f":"IF(M39=0,,IF('INFO Blatt'!B$3<6,14-M39*2,'INFO Blatt'!B$3*2+2-M39*2))","v":0}]
["M8",{"$f":"'M8'!S$30","v":0},0,{"$f":"IF(C40=0,,IF('INFO Blatt'!B$3<6,14-C40*2,'INFO Blatt'!B$3*2+2-C40*2))","v":0},null,"M8",{"$f":"'M8'!W$30","v":0},0,{"$f":"IF(H40=0,,IF('INFO Blatt'!B$3<6,14-H40*2,'INFO Blatt'!B$3*2+2-H40*2))","v":0},null,"M8",{"$f":"'M8'!AA$30","v":0},0,{"$f":"IF(M40=0,,IF('INFO Blatt'!B$3<6,14-M40*2,'INFO Blatt'!B$3*2+2-M40*2))","v":0}]
["M9",{"$f":"'M9'!S$30","v":0},0,{"$f":"IF(C41=0,,IF('INFO Blatt'!B$3<6,14-C41*2,'INFO Blatt'!B$3*2+2-C41*2))","v":0},null,"M9",{"$f":"'M9'!W$30","v":0},0,{"$f":"IF(H41=0,,IF('INFO Blatt'!B$3<6,14-H41*2,'INFO Blatt'!B$3*2+2-H41*2))","v":0},null,"M9",{"$f":"'M9'!AA$30","v":0},0,{"$f":"IF(M41=0,,IF('INFO Blatt'!B$3<6,14-M41*2,'INFO Blatt'!B$3*2+2-M41*2))","v":0}]
["M10",{"$f":"'M10'!S$30","v":0},0,{"$f":"IF(C42=0,,IF('INFO Blatt'!B$3<6,14-C42*2,'INFO Blatt'!B$3*2+2-C42*2))","v":0},null,"M10",{"$f":"'M10'!W$30","v":0},0,{"$f":"IF(H42=0,,IF('INFO Blatt'!B$3<6,14-H42*2,'INFO Blatt'!B$3*2+2-H42*2))","v":0},null,"M10",{"$f":"'M10'!AA$30","v":0},0,{"$f":"IF(M42=0,,IF('INFO Blatt'!B$3<6,14-M42*2,'INFO Blatt'!B$3*2+2-M42*2))","v":0}]

{"sheet":"Boffzen","index":4,"n_rows":40,"n_cols":33,"rows_kept":40,"cut":false,"hidden":false,"merged":[[36,26,37,26],[36,27,37,27],[34,23,35,23],[34,24,35,24],[34,26,35,26],[34,27,35,27],[36,0,37,0],[36,1,37,1],[36,2,37,2],[36,3,37,3],[36,4,37,4],[36,6,37,6],[36,7,37,7],[36,8,37,8],[36,10,37,10],[36,11,37,11],[36,12,37,12],[36,14,37,14],[36,15,37,15],[36,16,37,16],[36,18,37,18],[36,19,37,19],[36,20,37,20],[36,22,37,22],[36,23,37,23],[36,24,37,24],[34,11,35,11],[34,12,35,12],[34,14,35,14],[34,15,35,15],[34,16,35,16],[34,18,35,18],[34,19,35,19],[34,20,35,20],[34,22,35,22],[34,0,35,0],[34,1,35,1],[34,2,35,2],[34,3,35,3],[34,4,35,4],[34,6,35,6],[34,7,35,7],[34,8,35,8],[34,10,35,10],[30,26,31,26],[30,27,31,27],[32,0,33,0],[32,1,33,1],[32,2,33,2],[32,3,33,3],[32,4,33,4],[32,6,33,6],[32,7,33,7],[32,8,33,8],[32,10,33,10],[32,11,33,11],[32,12,33,12],[32,14,33,14],[32,15,33,15],[32,16,33,16],[32,18,33,18],[32,19,33,19],[32,20,33,20],[32,22,33,22],[32,23,33,23],[32,24,33,24],[32,26,33,26],[32,27,33,27],[28,23,29,23],[28,24,29,24],[28,26,29,26],[28,27,29,27],[30,0,31,0],[30,1,31,1],[30,2,31,2],[30,3,31,3],[30,4,31,4],[30,6,31,6],[30,7,31,7],[30,8,31,8],[30,10,31,10],[30,11,31,11],[30,12,31,12],[30,14,31,14],[30,15,31,15],[30,16,31,16],[30,18,31,18],[30,19,31,19],[30,20,31,20],[30,22,31,22],[30,23,31,23],[30,24,31,24],[28,11,29,11],[28,12,29,12],[28,14,29,14],[28,15,29,15],[28,16,29,16],[28,18,29,18],[28,19,29,19],[28,20,29,20],[28,22,29,22],[28,0,29,0],[28,1,29,1],[28,2,29,2],[28,3,29,3],[28,4,29,4],[28,6,29,6],[28,7,29,7],[28,8,29,8],[28,10,29,10],[26,0,27,0],[26,1,27,1],[26,2,27,2],[26,3,27,3],[26,4,27,4],[26,6,27,6],[26,7,27,7],[26,8,27,8],[20,0,21,0],[20,1,21,1],[20,2,21,2],[20,3,21,3],[24,0,25,0],[24,1,25,1],[24,2,25,2],[24,3,25,3],[24,4,25,4],[24,6,25,6],[20,4,21,4],[20,6,21,6],[20,7,21,7],[20,8,21,8],[26,10,27,10],[26,11,27,11],[26,12,27,12],[26,14,27,14],[26,15,27,15],[26,16,27,16],[0,14,0,16],[2,14,2,16],[4,14,4,16],[10,15,11,15],[20,16,21,16],[12,10,13,10],[12,11,13,11],[24,24,25,24],[24,26,25,26],[26,26,27,26],[24,27,25,27],[24,12,25,12],[24,14,25,14],[24,15,25,15],[24,16,25,16],[24,18,25,18],[24,19,25,19],[26,27,27,27],[26,22,27,22],[26,23,27,23],[26,24,27,24],[24,20,25,20],[26,18,27,18],[26,19,27,19],[26,20,27,20],[22,22,23,22],[22,7,23,7],[22,8,23,8],[22,10,23,10],[22,11,23,11],[22,12,23,12],[22,14,23,14],[24,22,25,22],[24,23,25,23],[24,7,25,7],[24,8,25,8],[24,10,25,10],[24,11,25,11],[22,15,23,15],[22,16,23,16],[22,18,23,18],[22,19,23,19],[22,20,23,20],[18,26,19,26],[20,26,21,26],[20,27,21,27],[22,0,23,0],[22,1,23,1],[22,2,23,2],[22,3,23,3],[22,4,23,4],[22,6,23,6],[20,18,21,18],[20,19,21,19],[20,20,21,20],[20,22,21,22],[20,23,21,23],[20,24,21,24],[20,10,21,10],[20,11,21,11],[20,12,21,12],[20,14,21,14],[20,15,21,15],[22,23,23,23],[22,24,23,24],[22,26,23,26],[22,27,23,27],[18,20,19,20],[18,22,19,22],[18,23,19,23],[18,24,19,24],[18,16,19,16],[18,18,19,18],[18,19,19,19],[18,4,19,4],[18,6,19,6],[18,7,19,7],[18,8,19,8],[18,10,19,10],[18,11,19,11],[16,23,17,23],[16,24,17,24],[16,26,17,26],[16,27,17,27],[18,0,19,0],[18,1,19,1],[18,2,19,2],[18,3,19,3],[16,15,17,15],[16,16,17,16],[16,18,17,18],[16,19,17,19],[16,20,17,20],[16,22,17,22],[16,7,17,7],[16,8,17,8],[16,10,17,10],[16,11,17,11],[16,12,17,12],[16,14,17,14],[18,27,19,27],[18,12,19,12],[18,14,19,14],[18,15,19,15],[16,0,17,0],[16,1,17,1],[16,2,17,2],[16,3,17,3],[16,4,17,4],[16,6,17,6],[14,18,15,18],[14,19,15,19],[14,20,15,20],[14,10,15,10],[14,11,15,11],[14,12,15,12],[14,14,15,14],[14,15,15,15],[14,16,15,16],[14,0,15,0],[14,1,15,1],[14,2,15,2],[14,3,15,3],[14,4,15,4],[14,6,15,6],[14,7,15,7],[14,8,15,8],[12,20,13,20],[12,22,13,22],[12,23,13,23],[12,24,13,24],[12,26,13,26],[14,26,15,26],[12,27,13,27],[12,12,13,12],[12,14,13,14],[12,15,13,15],[12,16,13,16],[12,18,13,18],[12,19,13,19],[14,27,15,27],[14,22,15,22],[14,23,15,23],[14,24,15,24],[12,0,13,0],[12,1,13,1],[12,2,13,2],[12,3,13,3],[10,14,11,14],[10,16,11,16],[10,18,11,18],[12,4,13,4],[12,6,13,6],[12,7,13,7],[12,8,13,8],[10,6,11,6],[10,7,11,7],[10,8,11,8],[10,10,11,10],[10,11,11,11],[10,12,11,12],[10,0,11,0],[10,1,11,1],[10,2,11,2],[10,3,11,3],[10,4,11,4],[10,23,11,23],[10,24,11,24],[10,26,11,26],[8,22,9,22],[8,23,9,23],[8,24,9,24],[8,26,9,26],[8,27,9,27],[8,14,9,14],[8,15,9,15],[8,16,9,16],[8,18,9,18],[8,19,9,19],[8,20,9,20],[10,27,11,27],[10,22,11,22],[10,19,11,19],[10,20,11,20],[6,19,6,22],[6,23,6,26],[0,12,0,13],[2,0,2,1],[2,5,2,7],[2,12,2,13],[8,0,9,0],[8,1,9,1],[8,2,9,2],[8,3,9,3],[8,4,9,4],[6,3,6,6],[6,7,6,10],[6,11,6,14],[6,15,6,18],[8,6,9,6],[8,7,9,7],[8,8,9,8],[8,10,9,10],[8,11,9,11],[8,12,9,12]]}
["Wettkampfbogen",null,null,null,null,null,null,null,null,null,null,null,"Datum:",null,{"$f":"'INFO Blatt'!B13","v":"2019-02-16"}]
[]
[null,null,null,null,null,null,null,null,null,null,null,null,"Ort:",null,{"$f":"'INFO Blatt'!B11","v":"Hehlen"}]
[]
[null,null,null,null,null,null,null,null,null,null,null,null,null,"Liga:",{"$f":"'INFO Blatt'!B7","v":"Einsteigerliga"}]
[]
["Name","Verein","Jg","Boden",null,null,null,"Pferd",null,null,null,"Ringe",null,null,null,"Sprung",null,null,null,"Barren",null,null,null,"Reck",null,null,null,"Ges."]
[null,null,null,"D-Note","Abzug OK","E- Abzug","Note","D-Note","Abzug OK","E- Abzug","Note","D-Note","Abzug OK","E-Abzug","Note","D-Note","Abzug OK","E-Abzug","Note","D-Note","Abzug OK","E-Abzug","Note","D-Note","Abzug OK","E-Abzug","Note"]
[{"$f":"'Wertungszettel M1'!A7","v":"Tom Esau"},{"$f":"Formeln!A5","v":"MTV Boffzen e.V. von 1892"},{"$f":"IF(A9<>\"\",VLOOKUP(A9,'Wertungszettel M1'!A$7:B$36,2,0),\"\")","v":"11.03.2010"},null,null,null,{"$f":"IF(AND(F9>0,F10>0),IF(OR(F9>10,F9<0,F10>10,F10<0),\"Fehler\",IF(ABS(D9)-ABS(E9)-(F9+F10)/2+10>0,IF(D9<0,-(ABS(D9)-ABS(E9)-(F9+F10)/2+10),D9-ABS(E9)-(F9+F10)/2+10),0)),0)","v":0},null,null,null,{"$f":"IF(AND(J9>0,J10>0),IF(OR(J9>10,J9<0,J10>10,J10<0),\"Fehler\",IF(ABS(H9)-ABS(I9)-(J9+J10)/2+10>0,IF(H9<0,-(ABS(H9)-ABS(I9)-(J9+J10)/2+10),H9-ABS(I9)-(J9+J10)/2+10),0)),0)","v":0},null,null,null,{"$f":"IF(AND(N9>0,N10>0),IF(OR(N9>10,N9<0,N10>10,N10<0),\"Fehler\",IF(ABS(L9)-ABS(M9)-(N9+N10)/2+10>0,IF(L9<0,-(ABS(L9)-ABS(M9)-(N9+N10)/2+10),L9-ABS(M9)-(N9+N10)/2+10),0)),0)","v":0},null,null,null,{"$f":"IF(AND(R9>0,R10>0),IF(OR(R9>10,R9<0,R10>10,R10<0),\"Fehler\",IF(ABS(P9)-ABS(Q9)-(R9+R10)/2+10>0,IF(P9<0,-(ABS(P9)-ABS(Q9)-(R9+R10)/2+10),P9-ABS(Q9)-(R9+R10)/2+10),0)),0)","v":0},null,null,null,{"$f":"IF(AND(V9>0,V10>0),IF(OR(V9>10,V9<0,V10>10,V10<0),\"Fehler\",IF(ABS(T9)-ABS(U9)-(V9+V10)/2+10>0,IF(T9<0,-(ABS(T9)-ABS(U9)-(V9+V10)/2+10),T9-ABS(U9)-(V9+V10)/2+10),0)),0)","v":0},null,null,null,{"$f":"IF(AND(Z9>0,Z10>0),IF(OR(Z9>10,Z9<0,Z10>10,Z10<0),\"Fehler\",IF(ABS(X9)-ABS(Y9)-(Z9+Z10)/2+10>0,IF(X9<0,-(ABS(X9)-ABS(Y9)-(Z9+Z10)/2+10),X9-ABS(Y9)-(Z9+Z10)/2+10),0)),0)","v":0},{"$f":"ABS(G9)+ABS(K9)+ABS(O9)+ABS(S9)+ABS(W9)+ABS(AA9)","v":0}]
[]
[{"$f":"'Wertungszettel M1'!A9","v":"Thorge Haak"},{"$f":"IF(A11>0,B9,\"\")","v":"MTV Boffzen e.V. von 1892"},{"$f":"IF(A11<>\"\",VLOOKUP(A11,'Wertungszettel M1'!A$7:B$36,2,0),\"\")","v":"21.01.2010"},4,1,3.6,{"$f":"IF(AND(F11>0,F12>0),IF(OR(F11>10,F11<0,F12>10,F12<0),\"Fehler\",IF(ABS(D11)-ABS(E11)-(F11+F12)/2+10>0,IF(D11<0,-(ABS(D11)-ABS(E11)-(F11+F12)/2+10),D11-ABS(E11)-(F11+F12)/2+10),0)),0)","v":9.4},5,null,3.5,{"$f":"IF(AND(J11>0,J12>0),IF(OR(J11>10,J11<0,J12>10,J12<0),\"Fehler\",IF(ABS(H11)-ABS(I11)-(J11+J12)/2+10>0,IF(H11<0,-(ABS(H11)-ABS(I11)-(J11+J12)/2+10),H11-ABS(I11)-(J11+J12)/2+10),0)),0)","v":11.5},5,null,2.2999999999999998,{"$f":"IF(AND(N11>0,N12>0),IF(OR(N11>10,N11<0,N12>10,N12<0),\"Fehler\",IF(ABS(L11)-ABS(M11)-(N11+N12)/2+10>0,IF(L11<0,-(ABS(L11)-ABS(M11)-(N11+N12)/2+10),L11-ABS(M11)-(N11+N12)/2+10),0)),0)","v":12.7},5,null,1.6,{"$f":"IF(AND(R11>0,R12>0),IF(OR(R11>10,R11<0,R12>10,R12<0),\"Fehler\",IF(ABS(P11)-ABS(Q11)-(R11+R12)/2+10>0,IF(P11<0,-(ABS(P11)-ABS(Q11)-(R11+R12)/2+10),P11-ABS(Q11)-(R11+R12)/2+10),0)),0)","v":13.4},5,null,1.3,{"$f":"IF(AND(V11>0,V12>0),IF(OR(V11>10,V11<0,V12>10,V12<0),\"Fehler\",IF(ABS(T11)-ABS(U11)-(V11+V12)/2+10>0,IF(T11<0,-(ABS(T11)-ABS(U11)-(V11+V12)/2+10),T11-ABS(U11)-(V11+V12)/2+10),0)),0)","v":13.6},5,null,2.9,{"$f":"IF(AND(Z11>0,Z12>0),IF(OR(Z11>10,Z11<0,Z12>10,Z12<0),\"Fehler\",IF(ABS(X11)-ABS(Y11)-(Z11+Z12)/2+10>0,IF(X11<0,-(ABS(X11)-ABS(Y11)-(Z11+Z12)/2+10),X11-ABS(Y11)-(Z11+Z12)/2+10),0)),0)","v":12.3},{"$f":"ABS(G11)+ABS(K11)+ABS(O11)+ABS(S11)+ABS(W11)+ABS(AA11)","v":72.899999999999991},null,null,null,"Boden",{"$f":"IF(G40>1,1,0)","v":1}]
[null,null,null,null,null,3.6,null,null,null,3.5,null,null,null,2.2999999999999998,null,null,null,1.6,null,null,null,1.5,null,null,null,2.5,null,null,null,null,null,"pauschenpferd",{"$f":"IF(K40>1,1,0)","v":1}]
[{"$f":"'Wertungszettel M1'!A11","v":"Robin Meisner"},{"$f":"IF(A13>0,B11,\"\")","v":"MTV Boffzen e.V. von 1892"},{"$f":"IF(A13<>\"\",VLOOKUP(A13,'Wertungszettel M1'!A$7:B$36,2,0),\"\")","v":"12.07.2010"},5,1,2.7,{"$f":"IF(AND(F13>0,F14>0),IF(OR(F13>10,F13<0,F14>10,F14<0),\"Fehler\",IF(ABS(D13)-ABS(E13)-(F13+F14)/2+10>0,IF(D13<0,-(ABS(D13)-ABS(E13)-(F13+F14)/2+10),D13-ABS(E13)-(F13+F14)/2+10),0)),0)","v":11.2},null,null,null,{"$f":"IF(AND(J13>0,J14>0),IF(OR(J13>10,J13<0,J14>10,J14<0),\"Fehler\",IF(ABS(H13)-ABS(I13)-(J13+J14)/2+10>0,IF(H13<0,-(ABS(H13)-ABS(I13)-(J13+J14)/2+10),H13-ABS(I13)-(J13+J14)/2+10),0)),0)","v":0},5,null,2.9,{"$f":"IF(AND(N13>0,N14>0),IF(OR(N13>10,N13<0,N14>10,N14<0),\"Fehler\",IF(ABS(L13)-ABS(M13)-(N13+N14)/2+10>0,IF(L13<0,-(ABS(L13)-ABS(M13)-(N13+N14)/2+10),L13-ABS(M13)-(N13+N14)/2+10),0)),0)","v":12.1},null,null,null,{"$f":"IF(AND(R13>0,R14>0),IF(OR(R13>10,R13<0,R14>10,R14<0),\"Fehler\",IF(ABS(P13)-ABS(Q13)-(R13+R14)/2+10>0,IF(P13<0,-(ABS(P13)-ABS(Q13)-(R13+R14)/2+10),P13-ABS(Q13)-(R13+R14)/2+10),0)),0)","v":0},null,null,null,{"$f":"IF(AND(V13>0,V14>0),IF(OR(V13>10,V13<0,V14>10,V14<0),\"Fehler\",IF(ABS(T13)-ABS(U13)-(V13+V14)/2+10>0,IF(T13<0,-(ABS(T13)-ABS(U13)-(V13+V14)/2+10),T13-ABS(U13)-(V13+V14)/2+10),0)),0)","v":0},5,null,3.1,{"$f":"IF(AND(Z13>0,Z14>0),IF(OR(Z13>10,Z13<0,Z14>10,Z14<0),\"Fehler\",IF(ABS(X13)-ABS(Y13)-(Z13+Z14)/2+10>0,IF(X13<0,-(ABS(X13)-ABS(Y13)-(Z13+Z14)/2+10),X13-ABS(Y13)-(Z13+Z14)/2+10),0)),0)","v":12.1},{"$f":"ABS(G13)+ABS(K13)+ABS(O13)+ABS(S13)+ABS(W13)+ABS(AA13)","v":35.4},null,null,null,"ringe",{"$f":"IF(O40>1,1,0)","v":1}]
[null,null,null,null,null,2.9,null,null,null,null,null,null,null,2.9,null,null,null,null,null,null,null,null,null,null,null,2.7,null,null,null,null,null,"sprung",{"$f":"IF(S40>1,1,0)","v":1}]
[{"$f":"'Wertungszettel M1'!A13","v":"Nick Bernhardt"},{"$f":"IF(A15>0,B13,\"\")","v":"MTV Boffzen e.V. von 1892"},{"$f":"IF(A15<>\"\",VLOOKUP(A15,'Wertungszettel M1'!A$7:B$36,2,0),\"\")","v":"29.05.2009"},5,0.5,4.4000000000000004,{"$f":"IF(AND(F15>0,F16>0),IF(OR(F15>10,F15<0,F16>10,F16<0),\"Fehler\",IF(ABS(D15)-ABS(E15)-(F15+F16)/2+10>0,IF(D15<0,-(ABS(D15)-ABS(E15)-(F15+F16)/2+10),D15-ABS(E15)-(F15+F16)/2+10),0)),0)","v":10.1},5,null,1.8,{"$f":"IF(AND(J15>0,J16>0),IF(OR(J15>10,J15<0,J16>10,J16<0),\"Fehler\",IF(ABS(H15)-ABS(I15)-(J15+J16)/2+10>0,IF(H15<0,-(ABS(H15)-ABS(I15)-(J15+J16)/2+10),H15-ABS(I15)-(J15+J16)/2+10),0)),0)","v":13.2},5,null,2.6,{"$f":"IF(AND(N15>0,N16>0),IF(OR(N15>10,N15<0,N16>10,N16<0),\"Fehler\",IF(ABS(L15)-ABS(M15)-(N15+N16)/2+10>0,IF(L15<0,-(ABS(L15)-ABS(M15)-(N15+N16)/2+10),L15-ABS(M15)-(N15+N16)/2+10),0)),0)","v":12.4},5,null,1.2,{"$f":"IF(AND(R15>0,R16>0),IF(OR(R15>10,R15<0,R16>10,R16<0),\"Fehler\",IF(ABS(P15)-ABS(Q15)-(R15+R16)/2+10>0,IF(P15<0,-(ABS(P15)-ABS(Q15)-(R15+R16)/2+10),P15-ABS(Q15)-(R15+R16)/2+10),0)),0)","v":13.85},5,null,1.8,{"$f":"IF(AND(V15>0,V16>0),IF(OR(V15>10,V15<0,V16>10,V16<0),\"Fehler\",IF(ABS(T15)-ABS(U15)-(V15+V16)/2+10>0,IF(T15<0,-(ABS(T15)-ABS(U15)-(V15+V16)/2+10),T15-ABS(U15)-(V15+V16)/2+10),0)),0)","v":13.3},5,null,3.8,{"$f":"IF(AND(Z15>0,Z16>0),IF(OR(Z15>10,Z15<0,Z16>10,Z16<0),\"Fehler\",IF(ABS(X15)-ABS(Y15)-(Z15+Z16)/2+10>0,IF(X15<0,-(ABS(X15)-ABS(Y15)-(Z15+Z16)/2+10),X15-ABS(Y15)-(Z15+Z16)/2+10),0)),0)","v":11.4},{"$f":"ABS(G15)+ABS(K15)+ABS(O15)+ABS(S15)+ABS(W15)+ABS(AA15)","v":74.25},null,null,null,"Barren",{"$f":"IF(W40>1,1,0)","v":1}]
[null,null,null,null,null,4.4000000000000004,null,null,null,1.8,null,null,null,2.6,null,null,null,1.1000000000000001,null,null,null,1.6,null,null,null,3.4,null,null,null,null,null,"Reck",{"$f":"IF(AA40>1,1,0)","v":1}]
[{"$f":"'Wertungszettel M1'!A15","v":"Nico Schilcher"},{"$f":"IF(A17>0,B15,\"\")","v":"MTV Boffzen e.V. von 1892"},{"$f":"IF(A17<>\"\",VLOOKUP(A17,'Wertungszettel M1'!A$7:B$36,2,0),\"\")","v":"26.01.2009"},5,null,4,{"$f":"IF(AND(F17>0,F18>0),IF(OR(F17>10,F17<0,F18>10,F18<0),\"Fehler\",IF(ABS(D17)-ABS(E17)-(F17+F18)/2+10>0,IF(D17<0,-(ABS(D17)-ABS(E17)-(F17+F18)/2+10),D17-ABS(E17)-(F17+F18)/2+10),0)),0)","v":11},5,null,3.9,{"$f":"IF(AND(J17>0,J18>0),IF(OR(J17>10,J17<0,J18>10,J18<0),\"Fehler\",IF(ABS(H17)-ABS(I17)-(J17+J18)/2+10>0,IF(H17<0,-(ABS(H17)-ABS(I17)-(J17+J18)/2+10),H17-ABS(I17)-(J17+J18)/2+10),0)),0)","v":11.1},5,null,1.2,{"$f":"IF(AND(N17>0,N18>0),IF(OR(N17>10,N17<0,N18>10,N18<0),\"Fehler\",IF(ABS(L17)-ABS(M17)-(N17+N18)/2+10>0,IF(L17<0,-(ABS(L17)-ABS(M17)-(N17+N18)/2+10),L17-ABS(M17)-(N17+N18)/2+10),0)),0)","v":13.8},null,null,null,{"$f":"IF(AND(R17>0,R18>0),IF(OR(R17>10,R17<0,R18>10,R18<0),\"Fehler\",IF(ABS(P17)-ABS(Q17)-(R17+R18)/2+10>0,IF(P17<0,-(ABS(P17)-ABS(Q17)-(R17+R18)/2+10),P17-ABS(Q17)-(R17+R18)/2+10),0)),0)","v":0},5,0.5,2.2000000000000002,{"$f":"IF(AND(V17>0,V18>0),IF(OR(V17>10,V17<0,V18>10,V18<0),\"Fehler\",IF(ABS(T17)-ABS(U17)-(V17+V18)/2+10>0,IF(T17<0,-(ABS(T17)-ABS(U17)-(V17+V18)/2+10),T17-ABS(U17)-(V17+V18)/2+10),0)),0)","v":12.1},5,null,2.8,{"$f":"IF(AND(Z17>0,Z18>0),IF(OR(Z17>10,Z17<0,Z18>10,Z18<0),\"Fehler\",IF(ABS(X17)-ABS(Y17)-(Z17+Z18)/2+10>0,IF(X17<0,-(ABS(X17)-ABS(Y17)-(Z17+Z18)/2+10),X17-ABS(Y17)-(Z17+Z18)/2+10),0)),0)","v":12.45},{"$f":"ABS(G17)+ABS(K17)+ABS(O17)+ABS(S17)+ABS(W17)+ABS(AA17)","v":60.45}]
[null,null,null,null,null,4,null,null,null,3.9,null,null,null,1.2,null,null,null,null,null,null,null,2.6,null,null,null,2.2999999999999998,null,null,null,null,null,"Gesamt",{"$f":"SUM(AG11:AG17)","v":6}]
[{"$f":"'Wertungszettel M1'!A17","v":"Benedikt Sievers"},{"$f":"IF(A19>0,B17,\"\")","v":"MTV Boffzen e.V. von 1892"},{"$f":"IF(A19<>\"\",VLOOKUP(A19,'Wertungszettel M1'!A$7:B$36,2,0),\"\")","v":"12.02.2010"},5,null,2.2000000000000002,{"$f":"IF(AND(F19>0,F20>0),IF(OR(F19>10,F19<0,F20>10,F20<0),\"Fehler\",IF(ABS(D19)-ABS(E19)-(F19+F20)/2+10>0,IF(D19<0,-(ABS(D19)-ABS(E19)-(F19+F20)/2+10),D19-ABS(E19)-(F19+F20)/2+10),0)),0)","v":12.95},5,null,5.2,{"$f":"IF(AND(J19>0,J20>0),IF(OR(J19>10,J19<0,J20>10,J20<0),\"Fehler\",IF(ABS(H19)-ABS(I19)-(J19+J20)/2+10>0,IF(H19<0,-(ABS(H19)-ABS(I19)-(J19+J20)/2+10),H19-ABS(I19)-(J19+J20)/2+10),0)),0)","v":9.8000000000000007},null,null,null,{"$f":"IF(AND(N19>0,N20>0),IF(OR(N19>10,N19<0,N20>10,N20<0),\"Fehler\",IF(ABS(L19)-ABS(M19)-(N19+N20)/2+10>0,IF(L19<0,-(ABS(L19)-ABS(M19)-(N19+N20)/2+10),L19-ABS(M19)-(N19+N20)/2+10),0)),0)","v":0},5,null,1.4,{"$f":"IF(AND(R19>0,R20>0),IF(OR(R19>10,R19<0,R20>10,R20<0),\"Fehler\",IF(ABS(P19)-ABS(Q19)-(R19+R20)/2+10>0,IF(P19<0,-(ABS(P19)-ABS(Q19)-(R19+R20)/2+10),P19-ABS(Q19)-(R19+R20)/2+10),0)),0)","v":13.6},5,null,2.2999999999999998,{"$f":"IF(AND(V19>0,V20>0),IF(OR(V19>10,V19<0,V20>10,V20<0),\"Fehler\",IF(ABS(T19)-ABS(U19)-(V19+V20)/2+10>0,IF(T19<0,-(ABS(T19)-ABS(U19)-(V19+V20)/2+10),T19-ABS(U19)-(V19+V20)/2+10),0)),0)","v":12.8},5,null,2.5,{"$f":"IF(AND(Z19>0,Z20>0),IF(OR(Z19>10,Z19<0,Z20>10,Z20<0),\"Fehler\",IF(ABS(X19)-ABS(Y19)-(Z19+Z20)/2+10>0,IF(X19<0,-(ABS(X19)-ABS(Y19)-(Z19+Z20)/2+10),X19-ABS(Y19)-(Z19+Z20)/2+10),0)),0)","v":12.6},{"$f":"ABS(G19)+ABS(K19)+ABS(O19)+ABS(S19)+ABS(W19)+ABS(AA19)","v":61.750000000000007}]
[null,null,null,null,null,1.9,null,null,null,5.2,null,null,null,null,null,null,null,1.4,null,null,null,2.1,null,null,null,2.2999999999999998]
[{"$f":"'Wertungszettel M1'!A19","v":"David Janzen"},{"$f":"IF(A21>0,B19,\"\")","v":"MTV Boffzen e.V. von 1892"},{"$f":"IF(A21<>\"\",VLOOKUP(A21,'Wertungszettel M1'!A$7:B$36,2,0),\"\")","v":"09.12.2008"},-4,null,1.1000000000000001,{"$f":"IF(AND(F21>0,F22>0),IF(OR(F21>10,F21<0,F22>10,F22<0),\"Fehler\",IF(ABS(D21)-ABS(E21)-(F21+F22)/2+10>0,IF(D21<0,-(ABS(D21)-ABS(E21)-(F21+F22)/2+10),D21-ABS(E21)-(F21+F22)/2+10),0)),0)","v":-12.95},4,null,2.8,{"$f":"IF(AND(J21>0,J22>0),IF(OR(J21>10,J21<0,J22>10,J22<0),\"Fehler\",IF(ABS(H21)-ABS(I21)-(J21+J22)/2+10>0,IF(H21<0,-(ABS(H21)-ABS(I21)-(J21+J22)/2+10),H21-ABS(I21)-(J21+J22)/2+10),0)),0)","v":11.2},5,null,2.5,{"$f":"IF(AND(N21>0,N22>0),IF(OR(N21>10,N21<0,N22>10,N22<0),\"Fehler\",IF(ABS(L21)-ABS(M21)-(N21+N22)/2+10>0,IF(L21<0,-(ABS(L21)-ABS(M21)-(N21+N22)/2+10),L21-ABS(M21)-(N21+N22)/2+10),0)),0)","v":12.5},5,null,1.8,{"$f":"IF(AND(R21>0,R22>0),IF(OR(R21>10,R21<0,R22>10,R22<0),\"Fehler\",IF(ABS(P21)-ABS(Q21)-(R21+R22)/2+10>0,IF(P21<0,-(ABS(P21)-ABS(Q21)-(R21+R22)/2+10),P21-ABS(Q21)-(R21+R22)/2+10),0)),0)","v":13.3},5,null,2.5,{"$f":"IF(AND(V21>0,V22>0),IF(OR(V21>10,V21<0,V22>10,V22<0),\"Fehler\",IF(ABS(T21)-ABS(U21)-(V21+V22)/2+10>0,IF(T21<0,-(ABS(T21)-ABS(U21)-(V21+V22)/2+10),T21-ABS(U21)-(V21+V22)/2+10),0)),0)","v":12.4},-4,null,3.8,{"$f":"IF(AND(Z21>0,Z22>0),IF(OR(Z21>10,Z21<0,Z22>10,Z22<0),\"Fehler\",IF(ABS(X21)-ABS(Y21)-(Z21+Z22)/2+10>0,IF(X21<0,-(ABS(X21)-ABS(Y21)-(Z21+Z22)/2+10),X21-ABS(Y21)-(Z21+Z22)/2+10),0)),0)","v":-10.199999999999999},{"$f":"ABS(G21)+ABS(K21)+ABS(O21)+ABS(S21)+ABS(W21)+ABS(AA21)","v":72.55}]
[null,null,null,null,null,1,null,null,null,2.8,null,null,null,2.5,null,null,null,1.6,null,null,null,2.7,null,null,null,3.8]
[{"$f":"'Wertungszettel M1'!A21","v":"Simon Janzen"},{"$f":"IF(A23>0,B21,\"\")","v":"MTV Boffzen e.V. von 1892"},{"$f":"IF(A23<>\"\",VLOOKUP(A23,'Wertungszettel M1'!A$7:B$36,2,0),\"\")","v":"07.07.2011"},null,null,null,{"$f":"IF(AND(F23>0,F24>0),IF(OR(F23>10,F23<0,F24>10,F24<0),\"Fehler\",IF(ABS(D23)-ABS(E23)-(F23+F24)/2+10>0,IF(D23<0,-(ABS(D23)-ABS(E23)-(F23+F24)/2+10),D23-ABS(E23)-(F23+F24)/2+10),0)),0)","v":0},-4,null,3.4,{"$f":"IF(AND(J23>0,J24>0),IF(OR(J23>10,J23<0,J24>10,J24<0),\"Fehler\",IF(ABS(H23)-ABS(I23)-(J23+J24)/2+10>0,IF(H23<0,-(ABS(H23)-ABS(I23)-(J23+J24)/2+10),H23-ABS(I23)-(J23+J24)/2+10),0)),0)","v":-10.6},null,null,null,{"$f":"IF(AND(N23>0,N24>0),IF(OR(N23>10,N23<0,N24>10,N24<0),\"Fehler\",IF(ABS(L23)-ABS(M23)-(N23+N24)/2+10>0,IF(L23<0,-(ABS(L23)-ABS(M23)-(N23+N24)/2+10),L23-ABS(M23)-(N23+N24)/2+10),0)),0)","v":0},null,null,null,{"$f":"IF(AND(R23>0,R24>0),IF(OR(R23>10,R23<0,R24>10,R24<0),\"Fehler\",IF(ABS(P23)-ABS(Q23)-(R23+R24)/2+10>0,IF(P23<0,-(ABS(P23)-ABS(Q23)-(R23+R24)/2+10),P23-ABS(Q23)-(R23+R24)/2+10),0)),0)","v":0},-4,null,1.6,{"$f":"IF(AND(V23>0,V24>0),IF(OR(V23>10,V23<0,V24>10,V24<0),\"Fehler\",IF(ABS(T23)-ABS(U23)-(V23+V24)/2+10>0,IF(T23<0,-(ABS(T23)-ABS(U23)-(V23+V24)/2+10),T23-ABS(U23)-(V23+V24)/2+10),0)),0)","v":-12.3},null,null,null,{"$f":"IF(AND(Z23>0,Z24>0),IF(OR(Z23>10,Z23<0,Z24>10,Z24<0),\"Fehler\",IF(ABS(X23)-ABS(Y23)-(Z23+Z24)/2+10>0,IF(X23<0,-(ABS(X23)-ABS(Y23)-(Z23+Z24)/2+10),X23-ABS(Y23)-(Z23+Z24)/2+10),0)),0)","v":0},{"$f":"ABS(G23)+ABS(K23)+ABS(O23)+ABS(S23)+ABS(W23)+ABS(AA23)","v":22.9}]
[null,null,null,null,null,null,null,null,null,3.4,null,null,null,null,null,null,null,null,null,null,null,1.8]
[{"$f":"'Wertungszettel M1'!A23","v":"frei 9"},{"$f":"IF(A25>0,B23,\"\")","v":"MTV Boffzen e.V. von 1892"},{"$f":"IF(A25<>\"\",VLOOKUP(A25,'Wertungszettel M1'!A$7:B$36,2,0),\"\")","v":0},null,null,null,{"$f":"IF(AND(F25>0,F26>0),IF(OR(F25>10,F25<0,F26>10,F26<0),\"Fehler\",IF(ABS(D25)-ABS(E25)-(F25+F26)/2+10>0,IF(D25<0,-(ABS(D25)-ABS(E25)-(F25+F26)/2+10),D25-ABS(E25)-(F25+F26)/2+10),0)),0)","v":0},null,null,null,{"$f":"IF(AND(J25>0,J26>0),IF(OR(J25>10,J25<0,J26>10,J26<0),\"Fehler\",IF(ABS(H25)-ABS(I25)-(J25+J26)/2+10>0,IF(H25<0,-(ABS(H25)-ABS(I25)-(J25+J26)/2+10),H25-ABS(I25)-(J25+J26)/2+10),0)),0)","v":0},null,null,null,{"$f":"IF(AND(N25>0,N26>0),IF(OR(N25>10,N25<0,N26>10,N26<0),\"Fehler\",IF(ABS(L25)-ABS(M25)-(N25+N26)/2+10>0,IF(L25<0,-(ABS(L25)-ABS(M25)-(N25+N26)/2+10),L25-ABS(M25)-(N25+N26)/2+10),0)),0)","v":0},null,null,null,{"$f":"IF(AND(R25>0,R26>0),IF(OR(R25>10,R25<0,R26>10,R26<0),\"Fehler\",IF(ABS(P25)-ABS(Q25)-(R25+R26)/2+10>0,IF(P25<0,-(ABS(P25)-ABS(Q25)-(R25+R26)/2+10),P25-ABS(Q25)-(R25+R26)/2+10),0)),0)","v":0},null,null,null,{"$f":"IF(AND(V25>0,V26>0),IF(OR(V25>10,V25<0,V26>10,V26<0),\"Fehler\",IF(ABS(T25)-ABS(U25)-(V25+V26)/2+10>0,IF(T25<0,-(ABS(T25)-ABS(U25)-(V25+V26)/2+10),T25-ABS(U25)-(V25+V26)/2+10),0)),0)","v":0},null,null,null,{"$f":"IF(AND(Z25>0,Z26>0),IF(OR(Z25>10,Z25<0,Z26>10,Z26<0),\"Fehler\",IF(ABS(X25)-ABS(Y25)-(Z25+Z26)/2+10>0,IF(X25<0,-(ABS(X25)-ABS(Y25)-(Z25+Z26)/2+10),X25-ABS(Y25)-(Z25+Z26)/2+10),0)),0)","v":0},{"$f":"ABS(G25)+ABS(K25)+ABS(O25)+ABS(S25)+ABS(W25)+ABS(AA25)","v":0}]
[]
[{"$f":"'Wertungszettel M1'!A25","v":"frei 10"},{"$f":"IF(A27>0,B25,\"\")","v":"MTV Boffzen e.V. von 1892"},{"$f":"IF(A27<>\"\",VLOOKUP(A27,'Wertungszettel M1'!A$7:B$36,2,0),\"\")","v":0},null,null,null,{"$f":"IF(AND(F27>0,F28>0),IF(OR(F27>10,F27<0,F28>10,F28<0),\"Fehler\",IF(ABS(D27)-ABS(E27)-(F27+F28)/2+10>0,IF(D27<0,-(ABS(D27)-ABS(E27)-(F27+F28)/2+10),D27-ABS(E27)-(F27+F28)/2+10),0)),0)","v":0},null,null,null,{"$f":"IF(AND(J27>0,J28>0),IF(OR(J27>10,J27<0,J28>10,J28<0),\"Fehler\",IF(ABS(H27)-ABS(I27)-(J27+J28)/2+10>0,IF(H27<0,-(ABS(H27)-ABS(I27)-(J27+J28)/2+10),H27-ABS(I27)-(J27+J28)/2+10),0)),0)","v":0},null,null,null,{"$f":"IF(AND(N27>0,N28>0),IF(OR(N27>10,N27<0,N28>10,N28<0),\"Fehler\",IF(ABS(L27)-ABS(M27)-(N27+N28)/2+10>0,IF(L27<0,-(ABS(L27)-ABS(M27)-(N27+N28)/2+10),L27-ABS(M27)-(N27+N28)/2+10),0)),0)","v":0},null,null,null,{"$f":"IF(AND(R27>0,R28>0),IF(OR(R27>10,R27<0,R28>10,R28<0),\"Fehler\",IF(ABS(P27)-ABS(Q27)-(R27+R28)/2+10>0,IF(P27<0,-(ABS(P27)-ABS(Q27)-(R27+R28)/2+10),P27-ABS(Q27)-(R27+R28)/2+10),0)),0)","v":0},null,null,null,{"$f":"IF(AND(V27>0,V28>0),IF(OR(V27>10,V27<0,V28>10,V28<0),\"Fehler\",IF(ABS(T27)-ABS(U27)-(V27+V28)/2+10>0,IF(T27<0,-(ABS(T27)-ABS(U27)-(V27+V28)/2+10),T27-ABS(U27)-(V27+V28)/2+10),0)),0)","v":0},null,null,null,{"$f":"IF(AND(Z27>0,Z28>0),IF(OR(Z27>10,Z27<0,Z28>10,Z28<0),\"Fehler\",IF(ABS(X27)-ABS(Y27)-(Z27+Z28)/2+10>0,IF(X27<0,-(ABS(X27)-ABS(Y27)-(Z27+Z28)/2+10),X27-ABS(Y27)-(Z27+Z28)/2+10),0)),0)","v":0},{"$f":"ABS(G27)+ABS(K27)+ABS(O27)+ABS(S27)+ABS(W27)+ABS(AA27)","v":0}]
[]
[{"$f":"'Wertungszettel M1'!A27","v":"frei 11"},{"$f":"IF(A29>0,B27,\"\")","v":"MTV Boffzen e.V. von 1892"},{"$f":"IF(A29<>\"\",VLOOKUP(A29,'Wertungszettel M1'!A$7:B$36,2,0),\"\")","v":0},null,null,null,{"$f":"IF(AND(F29>0,F30>0),IF(OR(F29>10,F29<0,F30>10,F30<0),\"Fehler\",IF(ABS(D30)-ABS(E30)-(F29+F30)/2+10>0,IF(D30<0,-(ABS(D30)-ABS(E30)-(F29+F30)/2+10),D29-ABS(E29)-(F29+F30)/2+10),0)),0)","v":0},null,null,null,{"$f":"IF(AND(J29>0,J30>0),IF(OR(J29>10,J29<0,J30>10,J30<0),\"Fehler\",IF(ABS(H30)-ABS(I30)-(J29+J30)/2+10>0,IF(H30<0,-(ABS(H30)-ABS(I30)-(J29+J30)/2+10),H29-ABS(I29)-(J29+J30)/2+10),0)),0)","v":0},null,null,null,{"$f":"IF(AND(N29>0,N30>0),IF(OR(N29>10,N29<0,N30>10,N30<0),\"Fehler\",IF(ABS(L30)-ABS(M30)-(N29+N30)/2+10>0,IF(L30<0,-(ABS(L30)-ABS(M30)-(N29+N30)/2+10),L29-ABS(M29)-(N29+N30)/2+10),0)),0)","v":0},null,null,null,{"$f":"IF(AND(R29>0,R30>0),IF(OR(R29>10,R29<0,R30>10,R30<0),\"Fehler\",IF(ABS(P30)-ABS(Q30)-(R29+R30)/2+10>0,IF(P30<0,-(ABS(P30)-ABS(Q30)-(R29+R30)/2+10),P29-ABS(Q29)-(R29+R30)/2+10),0)),0)","v":0},null,null,null,{"$f":"IF(AND(V29>0,V30>0),IF(OR(V29>10,V29<0,V30>10,V30<0),\"Fehler\",IF(ABS(T30)-ABS(U30)-(V29+V30)/2+10>0,IF(T30<0,-(ABS(T30)-ABS(U30)-(V29+V30)/2+10),T29-ABS(U29)-(V29+V30)/2+10),0)),0)","v":0},null,null,null,{"$f":"IF(AND(Z29>0,Z30>0),IF(OR(Z29>10,Z29<0,Z30>10,Z30<0),\"Fehler\",IF(ABS(X30)-ABS(Y30)-(Z29+Z30)/2+10>0,IF(X30<0,-(ABS(X30)-ABS(Y30)-(Z29+Z30)/2+10),X29-ABS(Y29)-(Z29+Z30)/2+10),0)),0)","v":0},{"$f":"ABS(G29)+ABS(K29)+ABS(O29)+ABS(S29)+ABS(W29)+ABS(AA29)","v":0}]
[]
[{"$f":"'Wertungszettel M1'!A29","v":"frei 12"},{"$f":"IF(A31>0,B29,\"\")","v":"MTV Boffzen e.V. von 1892"},{"$f":"IF(A31<>\"\",VLOOKUP(A31,'Wertungszettel M1'!A$7:B$36,2,0),\"\")","v":0},null,null,null,{"$f":"IF(AND(F31>0,F32>0),IF(OR(F31>10,F31<0,F32>10,F32<0),\"Fehler\",IF(ABS(D32)-ABS(E32)-(F31+F32)/2+10>0,IF(D32<0,-(ABS(D32)-ABS(E32)-(F31+F32)/2+10),D31-ABS(E31)-(F31+F32)/2+10),0)),0)","v":0},null,null,null,{"$f":"IF(AND(J31>0,J32>0),IF(OR(J31>10,J31<0,J32>10,J32<0),\"Fehler\",IF(ABS(H32)-ABS(I32)-(J31+J32)/2+10>0,IF(H32<0,-(ABS(H32)-ABS(I32)-(J31+J32)/2+10),H31-ABS(I31)-(J31+J32)/2+10),0)),0)","v":0},null,null,null,{"$f":"IF(AND(N31>0,N32>0),IF(OR(N31>10,N31<0,N32>10,N32<0),\"Fehler\",IF(ABS(L32)-ABS(M32)-(N31+N32)/2+10>0,IF(L32<0,-(ABS(L32)-ABS(M32)-(N31+N32)/2+10),L31-ABS(M31)-(N31+N32)/2+10),0)),0)","v":0},null,null,null,{"$f":"IF(AND(R31>0,R32>0),IF(OR(R31>10,R31<0,R32>10,R32<0),\"Fehler\",IF(ABS(P32)-ABS(Q32)-(R31+R32)/2+10>0,IF(P32<0,-(ABS(P32)-ABS(Q32)-(R31+R32)/2+10),P31-ABS(Q31)-(R31+R32)/2+10),0)),0)","v":0},null,null,null,{"$f":"IF(AND(V31>0,V32>0),IF(OR(V31>10,V31<0,V32>10,V32<0),\"Fehler\",IF(ABS(T32)-ABS(U32)-(V31+V32)/2+10>0,IF(T32<0,-(ABS(T32)-ABS(U32)-(V31+V32)/2+10),T31-ABS(U31)-(V31+V32)/2+10),0)),0)","v":0},null,null,null,{"$f":"IF(AND(Z31>0,Z32>0),IF(OR(Z31>10,Z31<0,Z32>10,Z32<0),\"Fehler\",IF(ABS(X32)-ABS(Y32)-(Z31+Z32)/2+10>0,IF(X32<0,-(ABS(X32)-ABS(Y32)-(Z31+Z32)/2+10),X31-ABS(Y31)-(Z31+Z32)/2+10),0)),0)","v":0},{"$f":"ABS(G31)+ABS(K31)+ABS(O31)+ABS(S31)+ABS(W31)+ABS(AA31)","v":0}]
[]
[{"$f":"'Wertungszettel M1'!A31","v":"frei 13"},{"$f":"IF(A33>0,B31,\"\")","v":"MTV Boffzen e.V. von 1892"},{"$f":"IF(A33<>\"\",VLOOKUP(A33,'Wertungszettel M1'!A$7:B$36,2,0),\"\")","v":0},null,null,null,{"$f":"IF(AND(F33>0,F34>0),IF(OR(F33>10,F33<0,F34>10,F34<0),\"Fehler\",IF(ABS(D34)-ABS(E34)-(F33+F34)/2+10>0,IF(D34<0,-(ABS(D34)-ABS(E34)-(F33+F34)/2+10),D33-ABS(E33)-(F33+F34)/2+10),0)),0)","v":0},null,null,null,{"$f":"IF(AND(J33>0,J34>0),IF(OR(J33>10,J33<0,J34>10,J34<0),\"Fehler\",IF(ABS(H34)-ABS(I34)-(J33+J34)/2+10>0,IF(H34<0,-(ABS(H34)-ABS(I34)-(J33+J34)/2+10),H33-ABS(I33)-(J33+J34)/2+10),0)),0)","v":0},null,null,null,{"$f":"IF(AND(N33>0,N34>0),IF(OR(N33>10,N33<0,N34>10,N34<0),\"Fehler\",IF(ABS(L34)-ABS(M34)-(N33+N34)/2+10>0,IF(L34<0,-(ABS(L34)-ABS(M34)-(N33+N34)/2+10),L33-ABS(M33)-(N33+N34)/2+10),0)),0)","v":0},null,null,null,{"$f":"IF(AND(R33>0,R34>0),IF(OR(R33>10,R33<0,R34>10,R34<0),\"Fehler\",IF(ABS(P34)-ABS(Q34)-(R33+R34)/2+10>0,IF(P34<0,-(ABS(P34)-ABS(Q34)-(R33+R34)/2+10),P33-ABS(Q33)-(R33+R34)/2+10),0)),0)","v":0},null,null,null,{"$f":"IF(AND(V33>0,V34>0),IF(OR(V33>10,V33<0,V34>10,V34<0),\"Fehler\",IF(ABS(T34)-ABS(U34)-(V33+V34)/2+10>0,IF(T34<0,-(ABS(T34)-ABS(U34)-(V33+V34)/2+10),T33-ABS(U33)-(V33+V34)/2+10),0)),0)","v":0},null,null,null,{"$f":"IF(AND(Z33>0,Z34>0),IF(OR(Z33>10,Z33<0,Z34>10,Z34<0),\"Fehler\",IF(ABS(X34)-ABS(Y34)-(Z33+Z34)/2+10>0,IF(X34<0,-(ABS(X34)-ABS(Y34)-(Z33+Z34)/2+10),X33-ABS(Y33)-(Z33+Z34)/2+10),0)),0)","v":0},{"$f":"ABS(G33)+ABS(K33)+ABS(O33)+ABS(S33)+ABS(W33)+ABS(AA33)","v":0}]
[]
[{"$f":"'Wertungszettel M1'!A33","v":"frei 14"},{"$f":"IF(A35>0,B33,\"\")","v":"MTV Boffzen e.V. von 1892"},{"$f":"IF(A35<>\"\",VLOOKUP(A35,'Wertungszettel M1'!A$7:B$36,2,0),\"\")","v":0},null,null,null,{"$f":"IF(AND(F35>0,F36>0),IF(OR(F35>10,F35<0,F36>10,F36<0),\"Fehler\",IF(ABS(D36)-ABS(E36)-(F35+F36)/2+10>0,IF(D36<0,-(ABS(D36)-ABS(E36)-(F35+F36)/2+10),D35-ABS(E35)-(F35+F36)/2+10),0)),0)","v":0},null,null,null,{"$f":"IF(AND(J35>0,J36>0),IF(OR(J35>10,J35<0,J36>10,J36<0),\"Fehler\",IF(ABS(H36)-ABS(I36)-(J35+J36)/2+10>0,IF(H36<0,-(ABS(H36)-ABS(I36)-(J35+J36)/2+10),H35-ABS(I35)-(J35+J36)/2+10),0)),0)","v":0},null,null,null,{"$f":"IF(AND(N35>0,N36>0),IF(OR(N35>10,N35<0,N36>10,N36<0),\"Fehler\",IF(ABS(L36)-ABS(M36)-(N35+N36)/2+10>0,IF(L36<0,-(ABS(L36)-ABS(M36)-(N35+N36)/2+10),L35-ABS(M35)-(N35+N36)/2+10),0)),0)","v":0},null,null,null,{"$f":"IF(AND(R35>0,R36>0),IF(OR(R35>10,R35<0,R36>10,R36<0),\"Fehler\",IF(ABS(P36)-ABS(Q36)-(R35+R36)/2+10>0,IF(P36<0,-(ABS(P36)-ABS(Q36)-(R35+R36)/2+10),P35-ABS(Q35)-(R35+R36)/2+10),0)),0)","v":0},null,null,null,{"$f":"IF(AND(V35>0,V36>0),IF(OR(V35>10,V35<0,V36>10,V36<0),\"Fehler\",IF(ABS(T36)-ABS(U36)-(V35+V36)/2+10>0,IF(T36<0,-(ABS(T36)-ABS(U36)-(V35+V36)/2+10),T35-ABS(U35)-(V35+V36)/2+10),0)),0)","v":0},null,null,null,{"$f":"IF(AND(Z35>0,Z36>0),IF(OR(Z35>10,Z35<0,Z36>10,Z36<0),\"Fehler\",IF(ABS(X36)-ABS(Y36)-(Z35+Z36)/2+10>0,IF(X36<0,-(ABS(X36)-ABS(Y36)-(Z35+Z36)/2+10),X35-ABS(Y35)-(Z35+Z36)/2+10),0)),0)","v":0},{"$f":"ABS(G35)+ABS(K35)+ABS(O35)+ABS(S35)+ABS(W35)+ABS(AA35)","v":0}]
[]
[{"$f":"'Wertungszettel M1'!A35","v":"frei 15"},{"$f":"IF(A37>0,B35,\"\")","v":"MTV Boffzen e.V. von 1892"},{"$f":"IF(A37<>\"\",VLOOKUP(A37,'Wertungszettel M1'!A$7:B$36,2,0),\"\")","v":0},null,null,null,{"$f":"IF(AND(F37>0,F38>0),IF(OR(F37>10,F37<0,F38>10,F38<0),\"Fehler\",IF(ABS(D38)-ABS(E38)-(F37+F38)/2+10>0,IF(D38<0,-(ABS(D38)-ABS(E38)-(F37+F38)/2+10),D37-ABS(E37)-(F37+F38)/2+10),0)),0)","v":0},null,null,null,{"$f":"IF(AND(J37>0,J38>0),IF(OR(J37>10,J37<0,J38>10,J38<0),\"Fehler\",IF(ABS(H38)-ABS(I38)-(J37+J38)/2+10>0,IF(H38<0,-(ABS(H38)-ABS(I38)-(J37+J38)/2+10),H37-ABS(I37)-(J37+J38)/2+10),0)),0)","v":0},null,null,null,{"$f":"IF(AND(N37>0,N38>0),IF(OR(N37>10,N37<0,N38>10,N38<0),\"Fehler\",IF(ABS(L38)-ABS(M38)-(N37+N38)/2+10>0,IF(L38<0,-(ABS(L38)-ABS(M38)-(N37+N38)/2+10),L37-ABS(M37)-(N37+N38)/2+10),0)),0)","v":0},null,null,null,{"$f":"IF(AND(R37>0,R38>0),IF(OR(R37>10,R37<0,R38>10,R38<0),\"Fehler\",IF(ABS(P38)-ABS(Q38)-(R37+R38)/2+10>0,IF(P38<0,-(ABS(P38)-ABS(Q38)-(R37+R38)/2+10),P37-ABS(Q37)-(R37+R38)/2+10),0)),0)","v":0},null,null,null,{"$f":"IF(AND(V37>0,V38>0),IF(OR(V37>10,V37<0,V38>10,V38<0),\"Fehler\",IF(ABS(T38)-ABS(U38)-(V37+V38)/2+10>0,IF(T38<0,-(ABS(T38)-ABS(U38)-(V37+V38)/2+10),T37-ABS(U37)-(V37+V38)/2+10),0)),0)","v":0},null,null,null,{"$f":"IF(AND(Z37>0,Z38>0),IF(OR(Z37>10,Z37<0,Z38>10,Z38<0),\"Fehler\",IF(ABS(X38)-ABS(Y38)-(Z37+Z38)/2+10>0,IF(X38<0,-(ABS(X38)-ABS(Y38)-(Z37+Z38)/2+10),X37-ABS(Y37)-(Z37+Z38)/2+10),0)),0)","v":0},{"$f":"ABS(G37)+ABS(K37)+ABS(O37)+ABS(S37)+ABS(W37)+ABS(AA37)","v":0}]
[]
[]
[null,null,null,null,null,null,{"$f":"SUM(LARGE(G9:G38,1),LARGE(G9:G38,2),LARGE(G9:G38,3))","v":35.15},null,null,null,{"$f":"SUM(LARGE(K9:K38,1),LARGE(K9:K38,2),LARGE(K9:K38,3))","v":35.9},null,null,null,{"$f":"SUM(LARGE(O9:O38,1),LARGE(O9:O38,2),LARGE(O9:O38,3))","v":39},null,null,null,{"$f":"SUM(LARGE(S9:S38,1),LARGE(S9:S38,2),LARGE(S9:S38,3))","v":40.85},null,null,null,{"$f":"SUM(LARGE(W9:W38,1),LARGE(W9:W38,2),LARGE(W9:W38,3))","v":39.700000000000003},null,null,null,{"$f":"SUM(LARGE(AA9:AA38,1),LARGE(AA9:AA38,2),LARGE(AA9:AA38,3))","v":37.349999999999994},{"$f":"SUM(G40,K40,O40,S40,W40,AA40)","v":227.95000000000002}]

{"sheet":"TG Oker_Salzg_Wenzen","index":5,"n_rows":40,"n_cols":33,"rows_kept":40,"cut":false,"hidden":false,"merged":[[36,26,37,26],[36,27,37,27],[34,23,35,23],[34,24,35,24],[34,26,35,26],[34,27,35,27],[36,0,37,0],[36,1,37,1],[36,2,37,2],[36,3,37,3],[36,4,37,4],[36,6,37,6],[36,7,37,7],[36,8,37,8],[36,10,37,10],[36,11,37,11],[36,12,37,12],[36,14,37,14],[36,15,37,15],[36,16,37,16],[36,18,37,18],[36,19,37,19],[36,20,37,20],[36,22,37,22],[36,23,37,23],[36,24,37,24],[34,11,35,11],[34,12,35,12],[34,14,35,14],[34,15,35,15],[34,16,35,16],[34,18,35,18],[34,19,35,19],[34,20,35,20],[34,22,35,22],[34,0,35,0],[34,1,35,1],[34,2,35,2],[34,3,35,3],[34,4,35,4],[34,6,35,6],[34,7,35,7],[34,8,35,8],[34,10,35,10],[30,26,31,26],[30,27,31,27],[32,0,33,0],[32,1,33,1],[32,2,33,2],[32,3,33,3],[32,4,33,4],[32,6,33,6],[32,7,33,7],[32,8,33,8],[32,10,33,10],[32,11,33,11],[32,12,33,12],[32,14,33,14],[32,15,33,15],[32,16,33,16],[32,18,33,18],[32,19,33,19],[32,20,33,20],[32,22,33,22],[32,23,33,23],[32,24,33,24],[32,26,33,26],[32,27,33,27],[28,23,29,23],[28,24,29,24],[28,26,29,26],[28,27,29,27],[30,0,31,0],[30,1,31,1],[30,2,31,2],[30,3,31,3],[30,4,31,4],[30,6,31,6],[30,7,31,7],[30,8,31,8],[30,10,31,10],[30,11,31,11],[30,12,31,12],[30,14,31,14],[30,15,31,15],[30,16,31,16],[30,18,31,18],[30,19,31,19],[30,20,31,20],[30,22,31,22],[30,23,31,23],[30,24,31,24],[28,11,29,11],[28,12,29,12],[28,14,29,14],[28,15,29,15],[28,16,29,16],[28,18,29,18],[28,19,29,19],[28,20,29,20],[28,22,29,22],[28,0,29,0],[28,1,29,1],[28,2,29,2],[28,3,29,3],[28,4,29,4],[28,6,29,6],[28,7,29,7],[28,8,29,8],[28,10,29,10],[12,8,13,8],[12,10,13,10],[12,11,13,11],[26,10,27,10],[26,11,27,11],[26,12,27,12],[26,14,27,14],[26,15,27,15],[26,16,27,16],[20,16,21,16],[26,0,27,0],[26,1,27,1],[26,2,27,2],[26,3,27,3],[26,4,27,4],[26,6,27,6],[26,7,27,7],[26,8,27,8],[20,0,21,0],[20,1,21,1],[20,2,21,2],[20,3,21,3],[24,0,25,0],[24,1,25,1],[24,2,25,2],[24,3,25,3],[24,4,25,4],[24,6,25,6],[20,4,21,4],[20,6,21,6],[20,7,21,7],[20,8,21,8],[24,24,25,24],[24,26,25,26],[26,26,27,26],[24,27,25,27],[24,12,25,12],[24,14,25,14],[24,15,25,15],[24,16,25,16],[24,18,25,18],[24,19,25,19],[26,27,27,27],[26,22,27,22],[26,23,27,23],[26,24,27,24],[24,20,25,20],[26,18,27,18],[26,19,27,19],[26,20,27,20],[22,22,23,22],[22,7,23,7],[22,8,23,8],[22,10,23,10],[22,11,23,11],[22,12,23,12],[22,14,23,14],[24,22,25,22],[24,23,25,23],[24,7,25,7],[24,8,25,8],[24,10,25,10],[24,11,25,11],[22,15,23,15],[22,16,23,16],[22,18,23,18],[22,19,23,19],[22,20,23,20],[18,26,19,26],[20,26,21,26],[20,27,21,27],[22,0,23,0],[22,1,23,1],[22,2,23,2],[22,3,23,3],[22,4,23,4],[22,6,23,6],[20,18,21,18],[20,19,21,19],[20,20,21,20],[20,22,21,22],[20,23,21,23],[20,24,21,24],[20,10,21,10],[20,11,21,11],[20,12,21,12],[20,14,21,14],[20,15,21,15],[22,23,23,23],[22,24,23,24],[22,26,23,26],[22,27,23,27],[18,20,19,20],[18,22,19,22],[18,23,19,23],[18,24,19,24],[18,16,19,16],[18,18,19,18],[18,19,19,19],[18,4,19,4],[18,6,19,6],[18,7,19,7],[18,8,19,8],[18,10,19,10],[18,11,19,11],[16,23,17,23],[16,24,17,24],[16,26,17,26],[16,27,17,27],[18,0,19,0],[18,1,19,1],[18,2,19,2],[18,3,19,3],[16,15,17,15],[16,16,17,16],[16,18,17,18],[16,19,17,19],[16,20,17,20],[16,22,17,22],[16,7,17,7],[16,8,17,8],[16,10,17,10],[16,11,17,11],[16,12,17,12],[16,14,17,14],[18,27,19,27],[18,12,19,12],[18,14,19,14],[18,15,19,15],[16,0,17,0],[16,1,17,1],[16,2,17,2],[16,3,17,3],[16,4,17,4],[16,6,17,6],[14,18,15,18],[14,19,15,19],[14,20,15,20],[14,10,15,10],[14,11,15,11],[14,12,15,12],[14,14,15,14],[14,15,15,15],[14,16,15,16],[14,0,15,0],[14,1,15,1],[14,2,15,2],[14,3,15,3],[14,4,15,4],[14,6,15,6],[14,7,15,7],[14,8,15,8],[12,22,13,22],[12,23,13,23],[12,24,13,24],[12,26,13,26],[14,26,15,26],[12,27,13,27],[12,12,13,12],[12,14,13,14],[12,15,13,15],[12,16,13,16],[12,18,13,18],[12,19,13,19],[14,27,15,27],[14,22,15,22],[14,23,15,23],[14,24,15,24],[12,0,13,0],[12,1,13,1],[12,2,13,2],[12,3,13,3],[10,14,11,14],[10,16,11,16],[10,18,11,18],[10,19,11,19],[10,20,11,20],[10,6,11,6],[10,7,11,7],[10,8,11,8],[10,10,11,10],[10,11,11,11],[10,12,11,12],[10,0,11,0],[10,1,11,1],[10,2,11,2],[10,3,11,3],[10,4,11,4],[12,20,13,20],[12,4,13,4],[12,6,13,6],[12,7,13,7],[10,23,11,23],[10,24,11,24],[10,26,11,26],[8,22,9,22],[8,23,9,23],[8,24,9,24],[8,26,9,26],[8,27,9,27],[8,14,9,14],[8,15,9,15],[8,16,9,16],[8,18,9,18],[8,19,9,19],[8,20,9,20],[10,27,11,27],[10,22,11,22],[10,15,11,15],[6,19,6,22],[6,23,6,26],[0,12,0,13],[2,0,2,1],[2,5,2,7],[2,12,2,13],[8,0,9,0],[8,1,9,1],[8,2,9,2],[8,3,9,3],[8,4,9,4],[6,3,6,6],[6,7,6,10],[6,11,6,14],[6,15,6,18],[8,6,9,6],[8,7,9,7],[8,8,9,8],[8,10,9,10],[8,11,9,11],[8,12,9,12],[4,14,4,16],[2,14,2,16],[0,14,0,16]]}
["Wettkampfbogen",null,null,null,null,null,null,null,null,null,null,null,"Datum:",null,{"$f":"'INFO Blatt'!B13","v":"2019-02-16"}]
[]
[null,null,null,null,null,null,null,null,null,null,null,null,"Ort:",null,{"$f":"'INFO Blatt'!B11","v":"Hehlen"}]
[]
[null,null,null,null,null,null,null,null,null,null,null,null,null,"Liga:",{"$f":"'INFO Blatt'!B7","v":"Einsteigerliga"}]
[]
["Name","Verein","Jg","Boden",null,null,null,"Pferd",null,null,null,"Ringe",null,null,null,"Sprung",null,null,null,"Barren",null,null,null,"Reck",null,null,null,"Ges."]
[null,null,null,"D-Note","Abzug OK","E- Abzug","Note","D-Note","Abzug OK","E- Abzug","Note","D-Note","Abzug OK","E-Abzug","Note","D-Note","Abzug OK","E-Abzug","Note","D-Note","Abzug OK","E-Abzug","Note","D-Note","Abzug OK","E-Abzug","Note"]
[{"$f":"'Wertungszettel M2'!A7","v":"Ian Sureshkumar"},{"$f":"Formeln!A6","v":"TG Oker/Salzgitter/Wenzen"},{"$f":"IF(A9<>\"\",VLOOKUP(A9,'Wertungszettel M2'!A$7:B$36,2,0),\"\")","v":"2009"},null,null,null,{"$f":"IF(AND(F9>0,F10>0),IF(OR(F9>10,F9<0,F10>10,F10<0),\"Fehler\",IF(ABS(D9)-ABS(E9)-(F9+F10)/2+10>0,IF(D9<0,-(ABS(D9)-ABS(E9)-(F9+F10)/2+10),D9-ABS(E9)-(F9+F10)/2+10),0)),0)","v":0},null,null,null,{"$f":"IF(AND(J9>0,J10>0),IF(OR(J9>10,J9<0,J10>10,J10<0),\"Fehler\",IF(ABS(H9)-ABS(I9)-(J9+J10)/2+10>0,IF(H9<0,-(ABS(H9)-ABS(I9)-(J9+J10)/2+10),H9-ABS(I9)-(J9+J10)/2+10),0)),0)","v":0},null,null,null,{"$f":"IF(AND(N9>0,N10>0),IF(OR(N9>10,N9<0,N10>10,N10<0),\"Fehler\",IF(ABS(L9)-ABS(M9)-(N9+N10)/2+10>0,IF(L9<0,-(ABS(L9)-ABS(M9)-(N9+N10)/2+10),L9-ABS(M9)-(N9+N10)/2+10),0)),0)","v":0},null,null,null,{"$f":"IF(AND(R9>0,R10>0),IF(OR(R9>10,R9<0,R10>10,R10<0),\"Fehler\",IF(ABS(P9)-ABS(Q9)-(R9+R10)/2+10>0,IF(P9<0,-(ABS(P9)-ABS(Q9)-(R9+R10)/2+10),P9-ABS(Q9)-(R9+R10)/2+10),0)),0)","v":0},null,null,null,{"$f":"IF(AND(V9>0,V10>0),IF(OR(V9>10,V9<0,V10>10,V10<0),\"Fehler\",IF(ABS(T9)-ABS(U9)-(V9+V10)/2+10>0,IF(T9<0,-(ABS(T9)-ABS(U9)-(V9+V10)/2+10),T9-ABS(U9)-(V9+V10)/2+10),0)),0)","v":0},null,null,null,{"$f":"IF(AND(Z9>0,Z10>0),IF(OR(Z9>10,Z9<0,Z10>10,Z10<0),\"Fehler\",IF(ABS(X9)-ABS(Y9)-(Z9+Z10)/2+10>0,IF(X9<0,-(ABS(X9)-ABS(Y9)-(Z9+Z10)/2+10),X9-ABS(Y9)-(Z9+Z10)/2+10),0)),0)","v":0},{"$f":"ABS(G9)+ABS(K9)+ABS(O9)+ABS(S9)+ABS(W9)+ABS(AA9)","v":0}]
[]
[{"$f":"'Wertungszettel M2'!A9","v":"Rayan Hijazi"},{"$f":"IF(A11>0,B9,\"\")","v":"TG Oker/Salzgitter/Wenzen"},{"$f":"IF(A11<>\"\",VLOOKUP(A11,'Wertungszettel M2'!A$7:B$36,2,0),\"\")","v":"2009"},null,null,null,{"$f":"IF(AND(F11>0,F12>0),IF(OR(F11>10,F11<0,F12>10,F12<0),\"Fehler\",IF(ABS(D11)-ABS(E11)-(F11+F12)/2+10>0,IF(D11<0,-(ABS(D11)-ABS(E11)-(F11+F12)/2+10),D11-ABS(E11)-(F11+F12)/2+10),0)),0)","v":0},null,null,null,{"$f":"IF(AND(J11>0,J12>0),IF(OR(J11>10,J11<0,J12>10,J12<0),\"Fehler\",IF(ABS(H11)-ABS(I11)-(J11+J12)/2+10>0,IF(H11<0,-(ABS(H11)-ABS(I11)-(J11+J12)/2+10),H11-ABS(I11)-(J11+J12)/2+10),0)),0)","v":0},null,null,null,{"$f":"IF(AND(N11>0,N12>0),IF(OR(N11>10,N11<0,N12>10,N12<0),\"Fehler\",IF(ABS(L11)-ABS(M11)-(N11+N12)/2+10>0,IF(L11<0,-(ABS(L11)-ABS(M11)-(N11+N12)/2+10),L11-ABS(M11)-(N11+N12)/2+10),0)),0)","v":0},null,null,null,{"$f":"IF(AND(R11>0,R12>0),IF(OR(R11>10,R11<0,R12>10,R12<0),\"Fehler\",IF(ABS(P11)-ABS(Q11)-(R11+R12)/2+10>0,IF(P11<0,-(ABS(P11)-ABS(Q11)-(R11+R12)/2+10),P11-ABS(Q11)-(R11+R12)/2+10),0)),0)","v":0},null,null,null,{"$f":"IF(AND(V11>0,V12>0),IF(OR(V11>10,V11<0,V12>10,V12<0),\"Fehler\",IF(ABS(T11)-ABS(U11)-(V11+V12)/2+10>0,IF(T11<0,-(ABS(T11)-ABS(U11)-(V11+V12)/2+10),T11-ABS(U11)-(V11+V12)/2+10),0)),0)","v":0},null,null,null,{"$f":"IF(AND(Z11>0,Z12>0),IF(OR(Z11>10,Z11<0,Z12>10,Z12<0),\"Fehler\",IF(ABS(X11)-ABS(Y11)-(Z11+Z12)/2+10>0,IF(X11<0,-(ABS(X11)-ABS(Y11)-(Z11+Z12)/2+10),X11-ABS(Y11)-(Z11+Z12)/2+10),0)),0)","v":0},{"$f":"ABS(G11)+ABS(K11)+ABS(O11)+ABS(S11)+ABS(W11)+ABS(AA11)","v":0},null,null,null,"Boden",{"$f":"IF(G40>1,1,0)","v":1}]
[null,null,null,null,null,null,null,null,null,null,null,null,null,null,null,null,null,null,null,null,null,null,null,null,null,null,null,null,null,null,null,"pauschenpferd",{"$f":"IF(K40>1,1,0)","v":1}]
[{"$f":"'Wertungszettel M2'!A11","v":"Emmanuel König"},{"$f":"IF(A13>0,B11,\"\")","v":"TG Oker/Salzgitter/Wenzen"},{"$f":"IF(A13<>\"\",VLOOKUP(A13,'Wertungszettel M2'!A$7:B$36,2,0),\"\")","v":"2012"},7,null,1.5,{"$f":"IF(AND(F13>0,F14>0),IF(OR(F13>10,F13<0,F14>10,F14<0),\"Fehler\",IF(ABS(D13)-ABS(E13)-(F13+F14)/2+10>0,IF(D13<0,-(ABS(D13)-ABS(E13)-(F13+F14)/2+10),D13-ABS(E13)-(F13+F14)/2+10),0)),0)","v":15.5},7,null,2.6,{"$f":"IF(AND(J13>0,J14>0),IF(OR(J13>10,J13<0,J14>10,J14<0),\"Fehler\",IF(ABS(H13)-ABS(I13)-(J13+J14)/2+10>0,IF(H13<0,-(ABS(H13)-ABS(I13)-(J13+J14)/2+10),H13-ABS(I13)-(J13+J14)/2+10),0)),0)","v":14.4},7,null,0.4,{"$f":"IF(AND(N13>0,N14>0),IF(OR(N13>10,N13<0,N14>10,N14<0),\"Fehler\",IF(ABS(L13)-ABS(M13)-(N13+N14)/2+10>0,IF(L13<0,-(ABS(L13)-ABS(M13)-(N13+N14)/2+10),L13-ABS(M13)-(N13+N14)/2+10),0)),0)","v":16.600000000000001},8,null,1,{"$f":"IF(AND(R13>0,R14>0),IF(OR(R13>10,R13<0,R14>10,R14<0),\"Fehler\",IF(ABS(P13)-ABS(Q13)-(R13+R14)/2+10>0,IF(P13<0,-(ABS(P13)-ABS(Q13)-(R13+R14)/2+10),P13-ABS(Q13)-(R13+R14)/2+10),0)),0)","v":17},7,null,0.8,{"$f":"IF(AND(V13>0,V14>0),IF(OR(V13>10,V13<0,V14>10,V14<0),\"Fehler\",IF(ABS(T13)-ABS(U13)-(V13+V14)/2+10>0,IF(T13<0,-(ABS(T13)-ABS(U13)-(V13+V14)/2+10),T13-ABS(U13)-(V13+V14)/2+10),0)),0)","v":16.2},8,null,2.8,{"$f":"IF(AND(Z13>0,Z14>0),IF(OR(Z13>10,Z13<0,Z14>10,Z14<0),\"Fehler\",IF(ABS(X13)-ABS(Y13)-(Z13+Z14)/2+10>0,IF(X13<0,-(ABS(X13)-ABS(Y13)-(Z13+Z14)/2+10),X13-ABS(Y13)-(Z13+Z14)/2+10),0)),0)","v":15.35},{"$f":"ABS(G13)+ABS(K13)+ABS(O13)+ABS(S13)+ABS(W13)+ABS(AA13)","v":95.05},null,null,null,"ringe",{"$f":"IF(O40>1,1,0)","v":1}]
[null,null,null,null,null,1.5,null,null,null,2.6,null,null,null,0.4,null,null,null,1,null,null,null,0.8,null,null,null,2.5,null,null,null,null,null,"sprung",{"$f":"IF(S40>1,1,0)","v":1}]
[{"$f":"'Wertungszettel M2'!A13","v":"Linus Ankert"},{"$f":"IF(A15>0,B13,\"\")","v":"TG Oker/Salzgitter/Wenzen"},{"$f":"IF(A15<>\"\",VLOOKUP(A15,'Wertungszettel M2'!A$7:B$36,2,0),\"\")","v":"2009"},5,null,4.5,{"$f":"IF(AND(F15>0,F16>0),IF(OR(F15>10,F15<0,F16>10,F16<0),\"Fehler\",IF(ABS(D15)-ABS(E15)-(F15+F16)/2+10>0,IF(D15<0,-(ABS(D15)-ABS(E15)-(F15+F16)/2+10),D15-ABS(E15)-(F15+F16)/2+10),0)),0)","v":10.9},4,null,2.4,{"$f":"IF(AND(J15>0,J16>0),IF(OR(J15>10,J15<0,J16>10,J16<0),\"Fehler\",IF(ABS(H15)-ABS(I15)-(J15+J16)/2+10>0,IF(H15<0,-(ABS(H15)-ABS(I15)-(J15+J16)/2+10),H15-ABS(I15)-(J15+J16)/2+10),0)),0)","v":11.6},5,null,3.2,{"$f":"IF(AND(N15>0,N16>0),IF(OR(N15>10,N15<0,N16>10,N16<0),\"Fehler\",IF(ABS(L15)-ABS(M15)-(N15+N16)/2+10>0,IF(L15<0,-(ABS(L15)-ABS(M15)-(N15+N16)/2+10),L15-ABS(M15)-(N15+N16)/2+10),0)),0)","v":11.8},5,null,1.1000000000000001,{"$f":"IF(AND(R15>0,R16>0),IF(OR(R15>10,R15<0,R16>10,R16<0),\"Fehler\",IF(ABS(P15)-ABS(Q15)-(R15+R16)/2+10>0,IF(P15<0,-(ABS(P15)-ABS(Q15)-(R15+R16)/2+10),P15-ABS(Q15)-(R15+R16)/2+10),0)),0)","v":13.9},7,2,2.4,{"$f":"IF(AND(V15>0,V16>0),IF(OR(V15>10,V15<0,V16>10,V16<0),\"Fehler\",IF(ABS(T15)-ABS(U15)-(V15+V16)/2+10>0,IF(T15<0,-(ABS(T15)-ABS(U15)-(V15+V16)/2+10),T15-ABS(U15)-(V15+V16)/2+10),0)),0)","v":12.6},5,null,2,{"$f":"IF(AND(Z15>0,Z16>0),IF(OR(Z15>10,Z15<0,Z16>10,Z16<0),\"Fehler\",IF(ABS(X15)-ABS(Y15)-(Z15+Z16)/2+10>0,IF(X15<0,-(ABS(X15)-ABS(Y15)-(Z15+Z16)/2+10),X15-ABS(Y15)-(Z15+Z16)/2+10),0)),0)","v":12.8},{"$f":"ABS(G15)+ABS(K15)+ABS(O15)+ABS(S15)+ABS(W15)+ABS(AA15)","v":73.599999999999994},null,null,null,"Barren",{"$f":"IF(W40>1,1,0)","v":1}]
[null,null,null,null,null,3.7,null,null,null,2.4,null,null,null,3.2,null,null,null,1.1000000000000001,null,null,null,2.4,null,null,null,2.4,null,null,null,null,null,"Reck",{"$f":"IF(AA40>1,1,0)","v":1}]
[{"$f":"'Wertungszettel M2'!A15","v":"Erik Pohler"},{"$f":"IF(A17>0,B15,\"\")","v":"TG Oker/Salzgitter/Wenzen"},{"$f":"IF(A17<>\"\",VLOOKUP(A17,'Wertungszettel M2'!A$7:B$36,2,0),\"\")","v":"2010"},5,null,3.5,{"$f":"IF(AND(F17>0,F18>0),IF(OR(F17>10,F17<0,F18>10,F18<0),\"Fehler\",IF(ABS(D17)-ABS(E17)-(F17+F18)/2+10>0,IF(D17<0,-(ABS(D17)-ABS(E17)-(F17+F18)/2+10),D17-ABS(E17)-(F17+F18)/2+10),0)),0)","v":11.4},7,null,2.2000000000000002,{"$f":"IF(AND(J17>0,J18>0),IF(OR(J17>10,J17<0,J18>10,J18<0),\"Fehler\",IF(ABS(H17)-ABS(I17)-(J17+J18)/2+10>0,IF(H17<0,-(ABS(H17)-ABS(I17)-(J17+J18)/2+10),H17-ABS(I17)-(J17+J18)/2+10),0)),0)","v":14.8},5,null,1.6,{"$f":"IF(AND(N17>0,N18>0),IF(OR(N17>10,N17<0,N18>10,N18<0),\"Fehler\",IF(ABS(L17)-ABS(M17)-(N17+N18)/2+10>0,IF(L17<0,-(ABS(L17)-ABS(M17)-(N17+N18)/2+10),L17-ABS(M17)-(N17+N18)/2+10),0)),0)","v":13.4},5,null,1.5,{"$f":"IF(AND(R17>0,R18>0),IF(OR(R17>10,R17<0,R18>10,R18<0),\"Fehler\",IF(ABS(P17)-ABS(Q17)-(R17+R18)/2+10>0,IF(P17<0,-(ABS(P17)-ABS(Q17)-(R17+R18)/2+10),P17-ABS(Q17)-(R17+R18)/2+10),0)),0)","v":13.5},7,null,1.2,{"$f":"IF(AND(V17>0,V18>0),IF(OR(V17>10,V17<0,V18>10,V18<0),\"Fehler\",IF(ABS(T17)-ABS(U17)-(V17+V18)/2+10>0,IF(T17<0,-(ABS(T17)-ABS(U17)-(V17+V18)/2+10),T17-ABS(U17)-(V17+V18)/2+10),0)),0)","v":15.9},5,null,1.2,{"$f":"IF(AND(Z17>0,Z18>0),IF(OR(Z17>10,Z17<0,Z18>10,Z18<0),\"Fehler\",IF(ABS(X17)-ABS(Y17)-(Z17+Z18)/2+10>0,IF(X17<0,-(ABS(X17)-ABS(Y17)-(Z17+Z18)/2+10),X17-ABS(Y17)-(Z17+Z18)/2+10),0)),0)","v":13.9},{"$f":"ABS(G17)+ABS(K17)+ABS(O17)+ABS(S17)+ABS(W17)+ABS(AA17)","v":82.9}]
[null,null,null,null,null,3.7,null,null,null,2.2000000000000002,null,null,null,1.6,null,null,null,1.5,null,null,null,1,null,null,null,1,null,null,null,null,null,"Gesamt",{"$f":"SUM(AG11:AG17)","v":6}]
[{"$f":"'Wertungszettel M2'!A17","v":"Mattis Westermann"},{"$f":"IF(A19>0,B17,\"\")","v":"TG Oker/Salzgitter/Wenzen"},{"$f":"IF(A19<>\"\",VLOOKUP(A19,'Wertungszettel M2'!A$7:B$36,2,0),\"\")","v":"2010"},null,null,null,{"$f":"IF(AND(F19>0,F20>0),IF(OR(F19>10,F19<0,F20>10,F20<0),\"Fehler\",IF(ABS(D19)-ABS(E19)-(F19+F20)/2+10>0,IF(D19<0,-(ABS(D19)-ABS(E19)-(F19+F20)/2+10),D19-ABS(E19)-(F19+F20)/2+10),0)),0)","v":0},null,null,null,{"$f":"IF(AND(J19>0,J20>0),IF(OR(J19>10,J19<0,J20>10,J20<0),\"Fehler\",IF(ABS(H19)-ABS(I19)-(J19+J20)/2+10>0,IF(H19<0,-(ABS(H19)-ABS(I19)-(J19+J20)/2+10),H19-ABS(I19)-(J19+J20)/2+10),0)),0)","v":0},null,null,null,{"$f":"IF(AND(N19>0,N20>0),IF(OR(N19>10,N19<0,N20>10,N20<0),\"Fehler\",IF(ABS(L19)-ABS(M19)-(N19+N20)/2+10>0,IF(L19<0,-(ABS(L19)-ABS(M19)-(N19+N20)/2+10),L19-ABS(M19)-(N19+N20)/2+10),0)),0)","v":0},null,null,null,{"$f":"IF(AND(R19>0,R20>0),IF(OR(R19>10,R19<0,R20>10,R20<0),\"Fehler\",IF(ABS(P19)-ABS(Q19)-(R19+R20)/2+10>0,IF(P19<0,-(ABS(P19)-ABS(Q19)-(R19+R20)/2+10),P19-ABS(Q19)-(R19+R20)/2+10),0)),0)","v":0},null,null,null,{"$f":"IF(AND(V19>0,V20>0),IF(OR(V19>10,V19<0,V20>10,V20<0),\"Fehler\",IF(ABS(T19)-ABS(U19)-(V19+V20)/2+10>0,IF(T19<0,-(ABS(T19)-ABS(U19)-(V19+V20)/2+10),T19-ABS(U19)-(V19+V20)/2+10),0)),0)","v":0},null,null,null,{"$f":"IF(AND(Z19>0,Z20>0),IF(OR(Z19>10,Z19<0,Z20>10,Z20<0),\"Fehler\",IF(ABS(X19)-ABS(Y19)-(Z19+Z20)/2+10>0,IF(X19<0,-(ABS(X19)-ABS(Y19)-(Z19+Z20)/2+10),X19-ABS(Y19)-(Z19+Z20)/2+10),0)),0)","v":0},{"$f":"ABS(G19)+ABS(K19)+ABS(O19)+ABS(S19)+ABS(W19)+ABS(AA19)","v":0}]
[]
[{"$f":"'Wertungszettel M2'!A19","v":"Felix Neuhoff"},{"$f":"IF(A21>0,B19,\"\")","v":"TG Oker/Salzgitter/Wenzen"},{"$f":"IF(A21<>\"\",VLOOKUP(A21,'Wertungszettel M2'!A$7:B$36,2,0),\"\")","v":"2011"},null,null,null,{"$f":"IF(AND(F21>0,F22>0),IF(OR(F21>10,F21<0,F22>10,F22<0),\"Fehler\",IF(ABS(D21)-ABS(E21)-(F21+F22)/2+10>0,IF(D21<0,-(ABS(D21)-ABS(E21)-(F21+F22)/2+10),D21-ABS(E21)-(F21+F22)/2+10),0)),0)","v":0},null,null,null,{"$f":"IF(AND(J21>0,J22>0),IF(OR(J21>10,J21<0,J22>10,J22<0),\"Fehler\",IF(ABS(H21)-ABS(I21)-(J21+J22)/2+10>0,IF(H21<0,-(ABS(H21)-ABS(I21)-(J21+J22)/2+10),H21-ABS(I21)-(J21+J22)/2+10),0)),0)","v":0},null,null,null,{"$f":"IF(AND(N21>0,N22>0),IF(OR(N21>10,N21<0,N22>10,N22<0),\"Fehler\",IF(ABS(L21)-ABS(M21)-(N21+N22)/2+10>0,IF(L21<0,-(ABS(L21)-ABS(M21)-(N21+N22)/2+10),L21-ABS(M21)-(N21+N22)/2+10),0)),0)","v":0},null,null,null,{"$f":"IF(AND(R21>0,R22>0),IF(OR(R21>10,R21<0,R22>10,R22<0),\"Fehler\",IF(ABS(P21)-ABS(Q21)-(R21+R22)/2+10>0,IF(P21<0,-(ABS(P21)-ABS(Q21)-(R21+R22)/2+10),P21-ABS(Q21)-(R21+R22)/2+10),0)),0)","v":0},null,null,null,{"$f":"IF(AND(V21>0,V22>0),IF(OR(V21>10,V21<0,V22>10,V22<0),\"Fehler\",IF(ABS(T21)-ABS(U21)-(V21+V22)/2+10>0,IF(T21<0,-(ABS(T21)-ABS(U21)-(V21+V22)/2+10),T21-ABS(U21)-(V21+V22)/2+10),0)),0)","v":0},null,null,null,{"$f":"IF(AND(Z21>0,Z22>0),IF(OR(Z21>10,Z21<0,Z22>10,Z22<0),\"Fehler\",IF(ABS(X21)-ABS(Y21)-(Z21+Z22)/2+10>0,IF(X21<0,-(ABS(X21)-ABS(Y21)-(Z21+Z22)/2+10),X21-ABS(Y21)-(Z21+Z22)/2+10),0)),0)","v":0},{"$f":"ABS(G21)+ABS(K21)+ABS(O21)+ABS(S21)+ABS(W21)+ABS(AA21)","v":0}]
[]
[{"$f":"'Wertungszettel M2'!A21","v":"frei 8"},{"$f":"IF(A23>0,B21,\"\")","v":"TG Oker/Salzgitter/Wenzen"},{"$f":"IF(A23<>\"\",VLOOKUP(A23,'Wertungszettel M2'!A$7:B$36,2,0),\"\")","v":0},null,null,null,{"$f":"IF(AND(F23>0,F24>0),IF(OR(F23>10,F23<0,F24>10,F24<0),\"Fehler\",IF(ABS(D23)-ABS(E23)-(F23+F24)/2+10>0,IF(D23<0,-(ABS(D23)-ABS(E23)-(F23+F24)/2+10),D23-ABS(E23)-(F23+F24)/2+10),0)),0)","v":0},null,null,null,{"$f":"IF(AND(J23>0,J24>0),IF(OR(J23>10,J23<0,J24>10,J24<0),\"Fehler\",IF(ABS(H23)-ABS(I23)-(J23+J24)/2+10>0,IF(H23<0,-(ABS(H23)-ABS(I23)-(J23+J24)/2+10),H23-ABS(I23)-(J23+J24)/2+10),0)),0)","v":0},null,null,null,{"$f":"IF(AND(N23>0,N24>0),IF(OR(N23>10,N23<0,N24>10,N24<0),\"Fehler\",IF(ABS(L23)-ABS(M23)-(N23+N24)/2+10>0,IF(L23<0,-(ABS(L23)-ABS(M23)-(N23+N24)/2+10),L23-ABS(M23)-(N23+N24)/2+10),0)),0)","v":0},null,null,null,{"$f":"IF(AND(R23>0,R24>0),IF(OR(R23>10,R23<0,R24>10,R24<0),\"Fehler\",IF(ABS(P23)-ABS(Q23)-(R23+R24)/2+10>0,IF(P23<0,-(ABS(P23)-ABS(Q23)-(R23+R24)/2+10),P23-ABS(Q23)-(R23+R24)/2+10),0)),0)","v":0},null,null,null,{"$f":"IF(AND(V23>0,V24>0),IF(OR(V23>10,V23<0,V24>10,V24<0),\"Fehler\",IF(ABS(T23)-ABS(U23)-(V23+V24)/2+10>0,IF(T23<0,-(ABS(T23)-ABS(U23)-(V23+V24)/2+10),T23-ABS(U23)-(V23+V24)/2+10),0)),0)","v":0},null,null,null,{"$f":"IF(AND(Z23>0,Z24>0),IF(OR(Z23>10,Z23<0,Z24>10,Z24<0),\"Fehler\",IF(ABS(X23)-ABS(Y23)-(Z23+Z24)/2+10>0,IF(X23<0,-(ABS(X23)-ABS(Y23)-(Z23+Z24)/2+10),X23-ABS(Y23)-(Z23+Z24)/2+10),0)),0)","v":0},{"$f":"ABS(G23)+ABS(K23)+ABS(O23)+ABS(S23)+ABS(W23)+ABS(AA23)","v":0}]
[]
[{"$f":"'Wertungszettel M2'!A23","v":"frei 9"},{"$f":"IF(A25>0,B23,\"\")","v":"TG Oker/Salzgitter/Wenzen"},{"$f":"IF(A25<>\"\",VLOOKUP(A25,'Wertungszettel M2'!A$7:B$36,2,0),\"\")","v":0},null,null,null,{"$f":"IF(AND(F25>0,F26>0),IF(OR(F25>10,F25<0,F26>10,F26<0),\"Fehler\",IF(ABS(D25)-ABS(E25)-(F25+F26)/2+10>0,IF(D25<0,-(ABS(D25)-ABS(E25)-(F25+F26)/2+10),D25-ABS(E25)-(F25+F26)/2+10),0)),0)","v":0},null,null,null,{"$f":"IF(AND(J25>0,J26>0),IF(OR(J25>10,J25<0,J26>10,J26<0),\"Fehler\",IF(ABS(H25)-ABS(I25)-(J25+J26)/2+10>0,IF(H25<0,-(ABS(H25)-ABS(I25)-(J25+J26)/2+10),H25-ABS(I25)-(J25+J26)/2+10),0)),0)","v":0},null,null,null,{"$f":"IF(AND(N25>0,N26>0),IF(OR(N25>10,N25<0,N26>10,N26<0),\"Fehler\",IF(ABS(L25)-ABS(M25)-(N25+N26)/2+10>0,IF(L25<0,-(ABS(L25)-ABS(M25)-(N25+N26)/2+10),L25-ABS(M25)-(N25+N26)/2+10),0)),0)","v":0},null,null,null,{"$f":"IF(AND(R25>0,R26>0),IF(OR(R25>10,R25<0,R26>10,R26<0),\"Fehler\",IF(ABS(P25)-ABS(Q25)-(R25+R26)/2+10>0,IF(P25<0,-(ABS(P25)-ABS(Q25)-(R25+R26)/2+10),P25-ABS(Q25)-(R25+R26)/2+10),0)),0)","v":0},null,null,null,{"$f":"IF(AND(V25>0,V26>0),IF(OR(V25>10,V25<0,V26>10,V26<0),\"Fehler\",IF(ABS(T25)-ABS(U25)-(V25+V26)/2+10>0,IF(T25<0,-(ABS(T25)-ABS(U25)-(V25+V26)/2+10),T25-ABS(U25)-(V25+V26)/2+10),0)),0)","v":0},null,null,null,{"$f":"IF(AND(Z25>0,Z26>0),IF(OR(Z25>10,Z25<0,Z26>10,Z26<0),\"Fehler\",IF(ABS(X25)-ABS(Y25)-(Z25+Z26)/2+10>0,IF(X25<0,-(ABS(X25)-ABS(Y25)-(Z25+Z26)/2+10),X25-ABS(Y25)-(Z25+Z26)/2+10),0)),0)","v":0},{"$f":"ABS(G25)+ABS(K25)+ABS(O25)+ABS(S25)+ABS(W25)+ABS(AA25)","v":0}]
[]
[{"$f":"'Wertungszettel M2'!A25","v":"frei 10"},{"$f":"IF(A27>0,B25,\"\")","v":"TG Oker/Salzgitter/Wenzen"},{"$f":"IF(A27<>\"\",VLOOKUP(A27,'Wertungszettel M2'!A$7:B$36,2,0),\"\")","v":0},null,null,null,{"$f":"IF(AND(F27>0,F28>0),IF(OR(F27>10,F27<0,F28>10,F28<0),\"Fehler\",IF(ABS(D27)-ABS(E27)-(F27+F28)/2+10>0,IF(D27<0,-(ABS(D27)-ABS(E27)-(F27+F28)/2+10),D27-ABS(E27)-(F27+F28)/2+10),0)),0)","v":0},null,null,null,{"$f":"IF(AND(J27>0,J28>0),IF(OR(J27>10,J27<0,J28>10,J28<0),\"Fehler\",IF(ABS(H27)-ABS(I27)-(J27+J28)/2+10>0,IF(H27<0,-(ABS(H27)-ABS(I27)-(J27+J28)/2+10),H27-ABS(I27)-(J27+J28)/2+10),0)),0)","v":0},null,null,null,{"$f":"IF(AND(N27>0,N28>0),IF(OR(N27>10,N27<0,N28>10,N28<0),\"Fehler\",IF(ABS(L27)-ABS(M27)-(N27+N28)/2+10>0,IF(L27<0,-(ABS(L27)-ABS(M27)-(N27+N28)/2+10),L27-ABS(M27)-(N27+N28)/2+10),0)),0)","v":0},null,null,null,{"$f":"IF(AND(R27>0,R28>0),IF(OR(R27>10,R27<0,R28>10,R28<0),\"Fehler\",IF(ABS(P27)-ABS(Q27)-(R27+R28)/2+10>0,IF(P27<0,-(ABS(P27)-ABS(Q27)-(R27+R28)/2+10),P27-ABS(Q27)-(R27+R28)/2+10),0)),0)","v":0},null,null,null,{"$f":"IF(AND(V27>0,V28>0),IF(OR(V27>10,V27<0,V28>10,V28<0),\"Fehler\",IF(ABS(T27)-ABS(U27)-(V27+V28)/2+10>0,IF(T27<0,-(ABS(T27)-ABS(U27)-(V27+V28)/2+10),T27-ABS(U27)-(V27+V28)/2+10),0)),0)","v":0},null,null,null,{"$f":"IF(AND(Z27>0,Z28>0),IF(OR(Z27>10,Z27<0,Z28>10,Z28<0),\"Fehler\",IF(ABS(X27)-ABS(Y27)-(Z27+Z28)/2+10>0,IF(X27<0,-(ABS(X27)-ABS(Y27)-(Z27+Z28)/2+10),X27-ABS(Y27)-(Z27+Z28)/2+10),0)),0)","v":0},{"$f":"ABS(G27)+ABS(K27)+ABS(O27)+ABS(S27)+ABS(W27)+ABS(AA27)","v":0}]
[]
[{"$f":"'Wertungszettel M2'!A27","v":"frei 11"},{"$f":"IF(A29>0,B27,\"\")","v":"TG Oker/Salzgitter/Wenzen"},{"$f":"IF(A29<>\"\",VLOOKUP(A29,'Wertungszettel M2'!A$7:B$36,2,0),\"\")","v":0},null,null,null,{"$f":"IF(AND(F29>0,F30>0),IF(OR(F29>10,F29<0,F30>10,F30<0),\"Fehler\",IF(ABS(D30)-ABS(E30)-(F29+F30)/2+10>0,IF(D30<0,-(ABS(D30)-ABS(E30)-(F29+F30)/2+10),D29-ABS(E29)-(F29+F30)/2+10),0)),0)","v":0},null,null,null,{"$f":"IF(AND(J29>0,J30>0),IF(OR(J29>10,J29<0,J30>10,J30<0),\"Fehler\",IF(ABS(H30)-ABS(I30)-(J29+J30)/2+10>0,IF(H30<0,-(ABS(H30)-ABS(I30)-(J29+J30)/2+10),H29-ABS(I29)-(J29+J30)/2+10),0)),0)","v":0},null,null,null,{"$f":"IF(AND(N29>0,N30>0),IF(OR(N29>10,N29<0,N30>10,N30<0),\"Fehler\",IF(ABS(L30)-ABS(M30)-(N29+N30)/2+10>0,IF(L30<0,-(ABS(L30)-ABS(M30)-(N29+N30)/2+10),L29-ABS(M29)-(N29+N30)/2+10),0)),0)","v":0},null,null,null,{"$f":"IF(AND(R29>0,R30>0),IF(OR(R29>10,R29<0,R30>10,R30<0),\"Fehler\",IF(ABS(P30)-ABS(Q30)-(R29+R30)/2+10>0,IF(P30<0,-(ABS(P30)-ABS(Q30)-(R29+R30)/2+10),P29-ABS(Q29)-(R29+R30)/2+10),0)),0)","v":0},null,null,null,{"$f":"IF(AND(V29>0,V30>0),IF(OR(V29>10,V29<0,V30>10,V30<0),\"Fehler\",IF(ABS(T30)-ABS(U30)-(V29+V30)/2+10>0,IF(T30<0,-(ABS(T30)-ABS(U30)-(V29+V30)/2+10),T29-ABS(U29)-(V29+V30)/2+10),0)),0)","v":0},null,null,null,{"$f":"IF(AND(Z29>0,Z30>0),IF(OR(Z29>10,Z29<0,Z30>10,Z30<0),\"Fehler\",IF(ABS(X30)-ABS(Y30)-(Z29+Z30)/2+10>0,IF(X30<0,-(ABS(X30)-ABS(Y30)-(Z29+Z30)/2+10),X29-ABS(Y29)-(Z29+Z30)/2+10),0)),0)","v":0},{"$f":"ABS(G29)+ABS(K29)+ABS(O29)+ABS(S29)+ABS(W29)+ABS(AA29)","v":0}]
[]
[{"$f":"'Wertungszettel M2'!A29","v":"frei 12"},{"$f":"IF(A31>0,B29,\"\")","v":"TG Oker/Salzgitter/Wenzen"},{"$f":"IF(A31<>\"\",VLOOKUP(A31,'Wertungszettel M2'!A$7:B$36,2,0),\"\")","v":0},null,null,null,{"$f":"IF(AND(F31>0,F32>0),IF(OR(F31>10,F31<0,F32>10,F32<0),\"Fehler\",IF(ABS(D32)-ABS(E32)-(F31+F32)/2+10>0,IF(D32<0,-(ABS(D32)-ABS(E32)-(F31+F32)/2+10),D31-ABS(E31)-(F31+F32)/2+10),0)),0)","v":0},null,null,null,{"$f":"IF(AND(J31>0,J32>0),IF(OR(J31>10,J31<0,J32>10,J32<0),\"Fehler\",IF(ABS(H32)-ABS(I32)-(J31+J32)/2+10>0,IF(H32<0,-(ABS(H32)-ABS(I32)-(J31+J32)/2+10),H31-ABS(I31)-(J31+J32)/2+10),0)),0)","v":0},null,null,null,{"$f":"IF(AND(N31>0,N32>0),IF(OR(N31>10,N31<0,N32>10,N32<0),\"Fehler\",IF(ABS(L32)-ABS(M32)-(N31+N32)/2+10>0,IF(L32<0,-(ABS(L32)-ABS(M32)-(N31+N32)/2+10),L31-ABS(M31)-(N31+N32)/2+10),0)),0)","v":0},null,null,null,{"$f":"IF(AND(R31>0,R32>0),IF(OR(R31>10,R31<0,R32>10,R32<0),\"Fehler\",IF(ABS(P32)-ABS(Q32)-(R31+R32)/2+10>0,IF(P32<0,-(ABS(P32)-ABS(Q32)-(R31+R32)/2+10),P31-ABS(Q31)-(R31+R32)/2+10),0)),0)","v":0},null,null,null,{"$f":"IF(AND(V31>0,V32>0),IF(OR(V31>10,V31<0,V32>10,V32<0),\"Fehler\",IF(ABS(T32)-ABS(U32)-(V31+V32)/2+10>0,IF(T32<0,-(ABS(T32)-ABS(U32)-(V31+V32)/2+10),T31-ABS(U31)-(V31+V32)/2+10),0)),0)","v":0},null,null,null,{"$f":"IF(AND(Z31>0,Z32>0),IF(OR(Z31>10,Z31<0,Z32>10,Z32<0),\"Fehler\",IF(ABS(X32)-ABS(Y32)-(Z31+Z32)/2+10>0,IF(X32<0,-(ABS(X32)-ABS(Y32)-(Z31+Z32)/2+10),X31-ABS(Y31)-(Z31+Z32)/2+10),0)),0)","v":0},{"$f":"ABS(G31)+ABS(K31)+ABS(O31)+ABS(S31)+ABS(W31)+ABS(AA31)","v":0}]
[]
[{"$f":"'Wertungszettel M2'!A31","v":"frei 13"},{"$f":"IF(A33>0,B31,\"\")","v":"TG Oker/Salzgitter/Wenzen"},{"$f":"IF(A33<>\"\",VLOOKUP(A33,'Wertungszettel M2'!A$7:B$36,2,0),\"\")","v":0},null,null,null,{"$f":"IF(AND(F33>0,F34>0),IF(OR(F33>10,F33<0,F34>10,F34<0),\"Fehler\",IF(ABS(D34)-ABS(E34)-(F33+F34)/2+10>0,IF(D34<0,-(ABS(D34)-ABS(E34)-(F33+F34)/2+10),D33-ABS(E33)-(F33+F34)/2+10),0)),0)","v":0},null,null,null,{"$f":"IF(AND(J33>0,J34>0),IF(OR(J33>10,J33<0,J34>10,J34<0),\"Fehler\",IF(ABS(H34)-ABS(I34)-(J33+J34)/2+10>0,IF(H34<0,-(ABS(H34)-ABS(I34)-(J33+J34)/2+10),H33-ABS(I33)-(J33+J34)/2+10),0)),0)","v":0},null,null,null,{"$f":"IF(AND(N33>0,N34>0),IF(OR(N33>10,N33<0,N34>10,N34<0),\"Fehler\",IF(ABS(L34)-ABS(M34)-(N33+N34)/2+10>0,IF(L34<0,-(ABS(L34)-ABS(M34)-(N33+N34)/2+10),L33-ABS(M33)-(N33+N34)/2+10),0)),0)","v":0},null,null,null,{"$f":"IF(AND(R33>0,R34>0),IF(OR(R33>10,R33<0,R34>10,R34<0),\"Fehler\",IF(ABS(P34)-ABS(Q34)-(R33+R34)/2+10>0,IF(P34<0,-(ABS(P34)-ABS(Q34)-(R33+R34)/2+10),P33-ABS(Q33)-(R33+R34)/2+10),0)),0)","v":0},null,null,null,{"$f":"IF(AND(V33>0,V34>0),IF(OR(V33>10,V33<0,V34>10,V34<0),\"Fehler\",IF(ABS(T34)-ABS(U34)-(V33+V34)/2+10>0,IF(T34<0,-(ABS(T34)-ABS(U34)-(V33+V34)/2+10),T33-ABS(U33)-(V33+V34)/2+10),0)),0)","v":0},null,null,null,{"$f":"IF(AND(Z33>0,Z34>0),IF(OR(Z33>10,Z33<0,Z34>10,Z34<0),\"Fehler\",IF(ABS(X34)-ABS(Y34)-(Z33+Z34)/2+10>0,IF(X34<0,-(ABS(X34)-ABS(Y34)-(Z33+Z34)/2+10),X33-ABS(Y33)-(Z33+Z34)/2+10),0)),0)","v":0},{"$f":"ABS(G33)+ABS(K33)+ABS(O33)+ABS(S33)+ABS(W33)+ABS(AA33)","v":0}]
[]
[{"$f":"'Wertungszettel M2'!A33","v":"frei 14"},{"$f":"IF(A35>0,B33,\"\")","v":"TG Oker/Salzgitter/Wenzen"},{"$f":"IF(A35<>\"\",VLOOKUP(A35,'Wertungszettel M2'!A$7:B$36,2,0),\"\")","v":0},null,null,null,{"$f":"IF(AND(F35>0,F36>0),IF(OR(F35>10,F35<0,F36>10,F36<0),\"Fehler\",IF(ABS(D36)-ABS(E36)-(F35+F36)/2+10>0,IF(D36<0,-(ABS(D36)-ABS(E36)-(F35+F36)/2+10),D35-ABS(E35)-(F35+F36)/2+10),0)),0)","v":0},null,null,null,{"$f":"IF(AND(J35>0,J36>0),IF(OR(J35>10,J35<0,J36>10,J36<0),\"Fehler\",IF(ABS(H36)-ABS(I36)-(J35+J36)/2+10>0,IF(H36<0,-(ABS(H36)-ABS(I36)-(J35+J36)/2+10),H35-ABS(I35)-(J35+J36)/2+10),0)),0)","v":0},null,null,null,{"$f":"IF(AND(N35>0,N36>0),IF(OR(N35>10,N35<0,N36>10,N36<0),\"Fehler\",IF(ABS(L36)-ABS(M36)-(N35+N36)/2+10>0,IF(L36<0,-(ABS(L36)-ABS(M36)-(N35+N36)/2+10),L35-ABS(M35)-(N35+N36)/2+10),0)),0)","v":0},null,null,null,{"$f":"IF(AND(R35>0,R36>0),IF(OR(R35>10,R35<0,R36>10,R36<0),\"Fehler\",IF(ABS(P36)-ABS(Q36)-(R35+R36)/2+10>0,IF(P36<0,-(ABS(P36)-ABS(Q36)-(R35+R36)/2+10),P35-ABS(Q35)-(R35+R36)/2+10),0)),0)","v":0},null,null,null,{"$f":"IF(AND(V35>0,V36>0),IF(OR(V35>10,V35<0,V36>10,V36<0),\"Fehler\",IF(ABS(T36)-ABS(U36)-(V35+V36)/2+10>0,IF(T36<0,-(ABS(T36)-ABS(U36)-(V35+V36)/2+10),T35-ABS(U35)-(V35+V36)/2+10),0)),0)","v":0},null,null,null,{"$f":"IF(AND(Z35>0,Z36>0),IF(OR(Z35>10,Z35<0,Z36>10,Z36<0),\"Fehler\",IF(ABS(X36)-ABS(Y36)-(Z35+Z36)/2+10>0,IF(X36<0,-(ABS(X36)-ABS(Y36)-(Z35+Z36)/2+10),X35-ABS(Y35)-(Z35+Z36)/2+10),0)),0)","v":0},{"$f":"ABS(G35)+ABS(K35)+ABS(O35)+ABS(S35)+ABS(W35)+ABS(AA35)","v":0}]
[]
[{"$f":"'Wertungszettel M2'!A35","v":"frei 15"},{"$f":"IF(A37>0,B35,\"\")","v":"TG Oker/Salzgitter/Wenzen"},{"$f":"IF(A37<>\"\",VLOOKUP(A37,'Wertungszettel M2'!A$7:B$36,2,0),\"\")","v":0},null,null,null,{"$f":"IF(AND(F37>0,F38>0),IF(OR(F37>10,F37<0,F38>10,F38<0),\"Fehler\",IF(ABS(D38)-ABS(E38)-(F37+F38)/2+10>0,IF(D38<0,-(ABS(D38)-ABS(E38)-(F37+F38)/2+10),D37-ABS(E37)-(F37+F38)/2+10),0)),0)","v":0},null,null,null,{"$f":"IF(AND(J37>0,J38>0),IF(OR(J37>10,J37<0,J38>10,J38<0),\"Fehler\",IF(ABS(H38)-ABS(I38)-(J37+J38)/2+10>0,IF(H38<0,-(ABS(H38)-ABS(I38)-(J37+J38)/2+10),H37-ABS(I37)-(J37+J38)/2+10),0)),0)","v":0},null,null,null,{"$f":"IF(AND(N37>0,N38>0),IF(OR(N37>10,N37<0,N38>10,N38<0),\"Fehler\",IF(ABS(L38)-ABS(M38)-(N37+N38)/2+10>0,IF(L38<0,-(ABS(L38)-ABS(M38)-(N37+N38)/2+10),L37-ABS(M37)-(N37+N38)/2+10),0)),0)","v":0},null,null,null,{"$f":"IF(AND(R37>0,R38>0),IF(OR(R37>10,R37<0,R38>10,R38<0),\"Fehler\",IF(ABS(P38)-ABS(Q38)-(R37+R38)/2+10>0,IF(P38<0,-(ABS(P38)-ABS(Q38)-(R37+R38)/2+10),P37-ABS(Q37)-(R37+R38)/2+10),0)),0)","v":0},null,null,null,{"$f":"IF(AND(V37>0,V38>0),IF(OR(V37>10,V37<0,V38>10,V38<0),\"Fehler\",IF(ABS(T38)-ABS(U38)-(V37+V38)/2+10>0,IF(T38<0,-(ABS(T38)-ABS(U38)-(V37+V38)/2+10),T37-ABS(U37)-(V37+V38)/2+10),0)),0)","v":0},null,null,null,{"$f":"IF(AND(Z37>0,Z38>0),IF(OR(Z37>10,Z37<0,Z38>10,Z38<0),\"Fehler\",IF(ABS(X38)-ABS(Y38)-(Z37+Z38)/2+10>0,IF(X38<0,-(ABS(X38)-ABS(Y38)-(Z37+Z38)/2+10),X37-ABS(Y37)-(Z37+Z38)/2+10),0)),0)","v":0},{"$f":"ABS(G37)+ABS(K37)+ABS(O37)+ABS(S37)+ABS(W37)+ABS(AA37)","v":0}]
[]
[]
[null,null,null,null,null,null,{"$f":"SUM(LARGE(G9:G38,1),LARGE(G9:G38,2),LARGE(G9:G38,3))","v":37.799999999999997},null,null,null,{"$f":"SUM(LARGE(K9:K38,1),LARGE(K9:K38,2),LARGE(K9:K38,3))","v":40.800000000000004},null,null,null,{"$f":"SUM(LARGE(O9:O38,1),LARGE(O9:O38,2),LARGE(O9:O38,3))","v":41.8},null,null,null,{"$f":"SUM(LARGE(S9:S38,1),LARGE(S9:S38,2),LARGE(S9:S38,3))","v":44.4},null,null,null,{"$f":"SUM(LARGE(W9:W38,1),LARGE(W9:W38,2),LARGE(W9:W38,3))","v":44.7},null,null,null,{"$f":"SUM(LARGE(AA9:AA38,1),LARGE(AA9:AA38,2),LARGE(AA9:AA38,3))","v":42.05},{"$f":"SUM(G40,K40,O40,S40,W40,AA40)","v":251.55}]

{"sheet":"LaPeKa","index":6,"n_rows":40,"n_cols":33,"rows_kept":40,"cut":false,"hidden":false,"merged":[[36,26,37,26],[36,27,37,27],[34,23,35,23],[34,24,35,24],[34,26,35,26],[34,27,35,27],[36,0,37,0],[36,1,37,1],[36,2,37,2],[36,3,37,3],[36,4,37,4],[36,6,37,6],[36,7,37,7],[36,8,37,8],[36,10,37,10],[36,11,37,11],[36,12,37,12],[36,14,37,14],[36,15,37,15],[36,16,37,16],[36,18,37,18],[36,19,37,19],[36,20,37,20],[36,22,37,22],[36,23,37,23],[36,24,37,24],[34,11,35,11],[34,12,35,12],[34,14,35,14],[34,15,35,15],[34,16,35,16],[34,18,35,18],[34,19,35,19],[34,20,35,20],[34,22,35,22],[34,0,35,0],[34,1,35,1],[34,2,35,2],[34,3,35,3],[34,4,35,4],[34,6,35,6],[34,7,35,7],[34,8,35,8],[34,10,35,10],[30,26,31,26],[30,27,31,27],[32,0,33,0],[32,1,33,1],[32,2,33,2],[32,3,33,3],[32,4,33,4],[32,6,33,6],[32,7,33,7],[32,8,33,8],[32,10,33,10],[32,11,33,11],[32,12,33,12],[32,14,33,14],[32,15,33,15],[32,16,33,16],[32,18,33,18],[32,19,33,19],[32,20,33,20],[32,22,33,22],[32,23,33,23],[32,24,33,24],[32,26,33,26],[32,27,33,27],[28,23,29,23],[28,24,29,24],[28,26,29,26],[28,27,29,27],[30,0,31,0],[30,1,31,1],[30,2,31,2],[30,3,31,3],[30,4,31,4],[30,6,31,6],[30,7,31,7],[30,8,31,8],[30,10,31,10],[30,11,31,11],[30,12,31,12],[30,14,31,14],[30,15,31,15],[30,16,31,16],[30,18,31,18],[30,19,31,19],[30,20,31,20],[30,22,31,22],[30,23,31,23],[30,24,31,24],[28,11,29,11],[28,12,29,12],[28,14,29,14],[28,15,29,15],[28,16,29,16],[28,18,29,18],[28,19,29,19],[28,20,29,20],[28,22,29,22],[28,0,29,0],[28,1,29,1],[28,2,29,2],[28,3,29,3],[28,4,29,4],[28,6,29,6],[28,7,29,7],[28,8,29,8],[28,10,29,10],[26,0,27,0],[26,1,27,1],[26,2,27,2],[26,3,27,3],[26,4,27,4],[26,6,27,6],[26,7,27,7],[26,8,27,8],[20,0,21,0],[20,1,21,1],[20,2,21,2],[20,3,21,3],[24,0,25,0],[24,1,25,1],[24,2,25,2],[24,3,25,3],[24,4,25,4],[24,6,25,6],[20,4,21,4],[20,6,21,6],[20,7,21,7],[20,8,21,8],[26,10,27,10],[26,11,27,11],[26,12,27,12],[26,14,27,14],[26,15,27,15],[26,16,27,16],[2,14,2,16],[0,14,0,16],[10,15,11,15],[12,10,13,10],[20,16,21,16],[12,11,13,11],[24,24,25,24],[24,26,25,26],[26,26,27,26],[24,27,25,27],[24,12,25,12],[24,14,25,14],[24,15,25,15],[24,16,25,16],[24,18,25,18],[24,19,25,19],[26,27,27,27],[26,22,27,22],[26,23,27,23],[26,24,27,24],[24,20,25,20],[26,18,27,18],[26,19,27,19],[26,20,27,20],[22,22,23,22],[22,7,23,7],[22,8,23,8],[22,10,23,10],[22,11,23,11],[22,12,23,12],[22,14,23,14],[24,22,25,22],[24,23,25,23],[24,7,25,7],[24,8,25,8],[24,10,25,10],[24,11,25,11],[22,15,23,15],[22,16,23,16],[22,18,23,18],[22,19,23,19],[22,20,23,20],[18,26,19,26],[20,26,21,26],[20,27,21,27],[22,0,23,0],[22,1,23,1],[22,2,23,2],[22,3,23,3],[22,4,23,4],[22,6,23,6],[20,18,21,18],[20,19,21,19],[20,20,21,20],[20,22,21,22],[20,23,21,23],[20,24,21,24],[20,10,21,10],[20,11,21,11],[20,12,21,12],[20,14,21,14],[20,15,21,15],[22,23,23,23],[22,24,23,24],[22,26,23,26],[22,27,23,27],[18,20,19,20],[18,22,19,22],[18,23,19,23],[18,24,19,24],[18,16,19,16],[18,18,19,18],[18,19,19,19],[18,4,19,4],[18,6,19,6],[18,7,19,7],[18,8,19,8],[18,10,19,10],[18,11,19,11],[16,23,17,23],[16,24,17,24],[16,26,17,26],[16,27,17,27],[18,0,19,0],[18,1,19,1],[18,2,19,2],[18,3,19,3],[16,15,17,15],[16,16,17,16],[16,18,17,18],[16,19,17,19],[16,20,17,20],[16,22,17,22],[16,7,17,7],[16,8,17,8],[16,10,17,10],[16,11,17,11],[16,12,17,12],[16,14,17,14],[18,27,19,27],[18,12,19,12],[18,14,19,14],[18,15,19,15],[16,0,17,0],[16,1,17,1],[16,2,17,2],[16,3,17,3],[16,4,17,4],[16,6,17,6],[14,18,15,18],[14,19,15,19],[14,20,15,20],[14,10,15,10],[14,11,15,11],[14,12,15,12],[14,14,15,14],[14,15,15,15],[14,16,15,16],[14,0,15,0],[14,1,15,1],[14,2,15,2],[14,3,15,3],[14,4,15,4],[14,6,15,6],[14,7,15,7],[14,8,15,8],[12,20,13,20],[12,22,13,22],[12,23,13,23],[12,24,13,24],[12,26,13,26],[14,26,15,26],[12,27,13,27],[12,12,13,12],[12,14,13,14],[12,15,13,15],[12,16,13,16],[12,18,13,18],[12,19,13,19],[14,27,15,27],[14,22,15,22],[14,23,15,23],[14,24,15,24],[12,0,13,0],[12,1,13,1],[12,2,13,2],[12,3,13,3],[10,14,11,14],[10,16,11,16],[10,18,11,18],[10,19,11,19],[12,4,13,4],[12,6,13,6],[12,7,13,7],[12,8,13,8],[10,6,11,6],[10,7,11,7],[10,8,11,8],[10,10,11,10],[10,11,11,11],[10,12,11,12],[10,0,11,0],[10,1,11,1],[10,2,11,2],[10,3,11,3],[10,4,11,4],[10,23,11,23],[10,24,11,24],[10,26,11,26],[8,22,9,22],[8,23,9,23],[8,24,9,24],[8,26,9,26],[8,27,9,27],[8,14,9,14],[8,15,9,15],[8,16,9,16],[8,18,9,18],[8,19,9,19],[8,20,9,20],[10,27,11,27],[10,22,11,22],[10,20,11,20],[6,19,6,22],[6,23,6,26],[0,12,0,13],[2,0,2,1],[2,5,2,7],[2,12,2,13],[8,0,9,0],[8,1,9,1],[8,2,9,2],[8,3,9,3],[8,4,9,4],[6,3,6,6],[6,7,6,10],[6,11,6,14],[6,15,6,18],[8,6,9,6],[8,7,9,7],[8,8,9,8],[8,10,9,10],[8,11,9,11],[8,12,9,12],[4,14,4,16]]}
["Wettkampfbogen",null,null,null,null,null,null,null,null,null,null,null,"Datum:",null,{"$f":"'INFO Blatt'!B13","v":"2019-02-16"}]
[]
[null,null,null,null,null,null,null,null,null,null,null,null,"Ort:",null,{"$f":"'INFO Blatt'!B11","v":"Hehlen"}]
[]
[null,null,null,null,null,null,null,null,null,null,null,null,null,"Liga:",{"$f":"'INFO Blatt'!B7","v":"Einsteigerliga"}]
[]
["Name","Verein","Jg","Boden",null,null,null,"Pferd",null,null,null,"Ringe",null,null,null,"Sprung",null,null,null,"Barren",null,null,null,"Reck",null,null,null,"Ges."]
[null,null,null,"D-Note","Abzug OK","E- Abzug","Note","D-Note","Abzug OK","E- Abzug","Note","D-Note","Abzug OK","E-Abzug","Note","D-Note","Abzug OK","E-Abzug","Note","D-Note","Abzug OK","E-Abzug","Note","D-Note","Abzug OK","E-Abzug","Note"]
[{"$f":"'Wertungszettel M3'!A7","v":"Lukas Sitzenstock"},{"$f":"Formeln!A7","v":"TG LaPeKa"},{"$f":"IF(A9<>\"\", VLOOKUP(A9,'Wertungszettel M3'!A$7:B$40,2,0),\"\")","v":0},5,1.5,3,{"$f":"IF(AND(F9>0,F10>0),IF(OR(F9>10,F9<0,F10>10,F10<0),\"Fehler\",IF(ABS(D9)-ABS(E9)-(F9+F10)/2+10>0,IF(D9<0,-(ABS(D9)-ABS(E9)-(F9+F10)/2+10),D9-ABS(E9)-(F9+F10)/2+10),0)),0)","v":10.25},4,null,4.8,{"$f":"IF(AND(J9>0,J10>0),IF(OR(J9>10,J9<0,J10>10,J10<0),\"Fehler\",IF(ABS(H9)-ABS(I9)-(J9+J10)/2+10>0,IF(H9<0,-(ABS(H9)-ABS(I9)-(J9+J10)/2+10),H9-ABS(I9)-(J9+J10)/2+10),0)),0)","v":9.1999999999999993},4,null,4.3,{"$f":"IF(AND(N9>0,N10>0),IF(OR(N9>10,N9<0,N10>10,N10<0),\"Fehler\",IF(ABS(L9)-ABS(M9)-(N9+N10)/2+10>0,IF(L9<0,-(ABS(L9)-ABS(M9)-(N9+N10)/2+10),L9-ABS(M9)-(N9+N10)/2+10),0)),0)","v":9.6999999999999993},5,null,1.7,{"$f":"IF(AND(R9>0,R10>0),IF(OR(R9>10,R9<0,R10>10,R10<0),\"Fehler\",IF(ABS(P9)-ABS(Q9)-(R9+R10)/2+10>0,IF(P9<0,-(ABS(P9)-ABS(Q9)-(R9+R10)/2+10),P9-ABS(Q9)-(R9+R10)/2+10),0)),0)","v":13.3},4,null,2.8,{"$f":"IF(AND(V9>0,V10>0),IF(OR(V9>10,V9<0,V10>10,V10<0),\"Fehler\",IF(ABS(T9)-ABS(U9)-(V9+V10)/2+10>0,IF(T9<0,-(ABS(T9)-ABS(U9)-(V9+V10)/2+10),T9-ABS(U9)-(V9+V10)/2+10),0)),0)","v":11.4},3,null,2.2000000000000002,{"$f":"IF(AND(Z9>0,Z10>0),IF(OR(Z9>10,Z9<0,Z10>10,Z10<0),\"Fehler\",IF(ABS(X9)-ABS(Y9)-(Z9+Z10)/2+10>0,IF(X9<0,-(ABS(X9)-ABS(Y9)-(Z9+Z10)/2+10),X9-ABS(Y9)-(Z9+Z10)/2+10),0)),0)","v":10.85},{"$f":"ABS(G9)+ABS(K9)+ABS(O9)+ABS(S9)+ABS(W9)+ABS(AA9)","v":64.7}]
[null,null,null,null,null,3.5,null,null,null,4.8,null,null,null,4.3,null,null,null,1.7,null,null,null,2.4,null,null,null,2.1]
[{"$f":"'Wertungszettel M3'!A9","v":"Til Mittag"},{"$f":"IF(A11>0,B9,\"\")","v":"TG LaPeKa"},{"$f":"IF(A11<>\"\", VLOOKUP(A11,'Wertungszettel M3'!A$7:B$40,2,0),\"\")","v":0},null,null,null,{"$f":"IF(AND(F11>0,F12>0),IF(OR(F11>10,F11<0,F12>10,F12<0),\"Fehler\",IF(ABS(D11)-ABS(E11)-(F11+F12)/2+10>0,IF(D11<0,-(ABS(D11)-ABS(E11)-(F11+F12)/2+10),D11-ABS(E11)-(F11+F12)/2+10),0)),0)","v":0},null,null,null,{"$f":"IF(AND(J11>0,J12>0),IF(OR(J11>10,J11<0,J12>10,J12<0),\"Fehler\",IF(ABS(H11)-ABS(I11)-(J11+J12)/2+10>0,IF(H11<0,-(ABS(H11)-ABS(I11)-(J11+J12)/2+10),H11-ABS(I11)-(J11+J12)/2+10),0)),0)","v":0},null,null,null,{"$f":"IF(AND(N11>0,N12>0),IF(OR(N11>10,N11<0,N12>10,N12<0),\"Fehler\",IF(ABS(L11)-ABS(M11)-(N11+N12)/2+10>0,IF(L11<0,-(ABS(L11)-ABS(M11)-(N11+N12)/2+10),L11-ABS(M11)-(N11+N12)/2+10),0)),0)","v":0},null,null,null,{"$f":"IF(AND(R11>0,R12>0),IF(OR(R11>10,R11<0,R12>10,R12<0),\"Fehler\",IF(ABS(P11)-ABS(Q11)-(R11+R12)/2+10>0,IF(P11<0,-(ABS(P11)-ABS(Q11)-(R11+R12)/2+10),P11-ABS(Q11)-(R11+R12)/2+10),0)),0)","v":0},null,null,null,{"$f":"IF(AND(V11>0,V12>0),IF(OR(V11>10,V11<0,V12>10,V12<0),\"Fehler\",IF(ABS(T11)-ABS(U11)-(V11+V12)/2+10>0,IF(T11<0,-(ABS(T11)-ABS(U11)-(V11+V12)/2+10),T11-ABS(U11)-(V11+V12)/2+10),0)),0)","v":0},null,null,null,{"$f":"IF(AND(Z11>0,Z12>0),IF(OR(Z11>10,Z11<0,Z12>10,Z12<0),\"Fehler\",IF(ABS(X11)-ABS(Y11)-(Z11+Z12)/2+10>0,IF(X11<0,-(ABS(X11)-ABS(Y11)-(Z11+Z12)/2+10),X11-ABS(Y11)-(Z11+Z12)/2+10),0)),0)","v":0},{"$f":"ABS(G11)+ABS(K11)+ABS(O11)+ABS(S11)+ABS(W11)+ABS(AA11)","v":0},null,null,null,"Boden",{"$f":"IF(G40>1,1,0)","v":1}]
[null,null,null,null,null,null,null,null,null,null,null,null,null,null,null,null,null,null,null,null,null,null,null,null,null,null,null,null,null,null,null,"pauschenpferd",{"$f":"IF(K40>1,1,0)","v":1}]
[{"$f":"'Wertungszettel M3'!A11","v":"Maxim Borgardt"},{"$f":"IF(A13>0,B11,\"\")","v":"TG LaPeKa"},{"$f":"IF(A13<>\"\", VLOOKUP(A13,'Wertungszettel M3'!A$7:B$40,2,0),\"\")","v":0},3,1.5,3,{"$f":"IF(AND(F13>0,F14>0),IF(OR(F13>10,F13<0,F14>10,F14<0),\"Fehler\",IF(ABS(D13)-ABS(E13)-(F13+F14)/2+10>0,IF(D13<0,-(ABS(D13)-ABS(E13)-(F13+F14)/2+10),D13-ABS(E13)-(F13+F14)/2+10),0)),0)","v":8.5},3,null,4.4000000000000004,{"$f":"IF(AND(J13>0,J14>0),IF(OR(J13>10,J13<0,J14>10,J14<0),\"Fehler\",IF(ABS(H13)-ABS(I13)-(J13+J14)/2+10>0,IF(H13<0,-(ABS(H13)-ABS(I13)-(J13+J14)/2+10),H13-ABS(I13)-(J13+J14)/2+10),0)),0)","v":8.6},3,null,4.4000000000000004,{"$f":"IF(AND(N13>0,N14>0),IF(OR(N13>10,N13<0,N14>10,N14<0),\"Fehler\",IF(ABS(L13)-ABS(M13)-(N13+N14)/2+10>0,IF(L13<0,-(ABS(L13)-ABS(M13)-(N13+N14)/2+10),L13-ABS(M13)-(N13+N14)/2+10),0)),0)","v":8.6},5,null,2.2000000000000002,{"$f":"IF(AND(R13>0,R14>0),IF(OR(R13>10,R13<0,R14>10,R14<0),\"Fehler\",IF(ABS(P13)-ABS(Q13)-(R13+R14)/2+10>0,IF(P13<0,-(ABS(P13)-ABS(Q13)-(R13+R14)/2+10),P13-ABS(Q13)-(R13+R14)/2+10),0)),0)","v":12.9},4,null,2.9,{"$f":"IF(AND(V13>0,V14>0),IF(OR(V13>10,V13<0,V14>10,V14<0),\"Fehler\",IF(ABS(T13)-ABS(U13)-(V13+V14)/2+10>0,IF(T13<0,-(ABS(T13)-ABS(U13)-(V13+V14)/2+10),T13-ABS(U13)-(V13+V14)/2+10),0)),0)","v":11.3},3,null,2,{"$f":"IF(AND(Z13>0,Z14>0),IF(OR(Z13>10,Z13<0,Z14>10,Z14<0),\"Fehler\",IF(ABS(X13)-ABS(Y13)-(Z13+Z14)/2+10>0,IF(X13<0,-(ABS(X13)-ABS(Y13)-(Z13+Z14)/2+10),X13-ABS(Y13)-(Z13+Z14)/2+10),0)),0)","v":11.05},{"$f":"ABS(G13)+ABS(K13)+ABS(O13)+ABS(S13)+ABS(W13)+ABS(AA13)","v":60.95},null,null,null,"ringe",{"$f":"IF(O40>1,1,0)","v":1}]
[null,null,null,null,null,3,null,null,null,4.4000000000000004,null,null,null,4.4000000000000004,null,null,null,2,null,null,null,2.5,null,null,null,1.9,null,null,null,null,null,"sprung",{"$f":"IF(S40>1,1,0)","v":1}]
[{"$f":"'Wertungszettel M3'!A13","v":"Maxim Nuss"},{"$f":"IF(A15>0,B13,\"\")","v":"TG LaPeKa"},{"$f":"IF(A15<>\"\", VLOOKUP(A15,'Wertungszettel M3'!A$7:B$40,2,0),\"\")","v":0},5,3,2.5,{"$f":"IF(AND(F15>0,F16>0),IF(OR(F15>10,F15<0,F16>10,F16<0),\"Fehler\",IF(ABS(D15)-ABS(E15)-(F15+F16)/2+10>0,IF(D15<0,-(ABS(D15)-ABS(E15)-(F15+F16)/2+10),D15-ABS(E15)-(F15+F16)/2+10),0)),0)","v":9.5},3,null,3.3,{"$f":"IF(AND(J15>0,J16>0),IF(OR(J15>10,J15<0,J16>10,J16<0),\"Fehler\",IF(ABS(H15)-ABS(I15)-(J15+J16)/2+10>0,IF(H15<0,-(ABS(H15)-ABS(I15)-(J15+J16)/2+10),H15-ABS(I15)-(J15+J16)/2+10),0)),0)","v":9.6999999999999993},null,null,null,{"$f":"IF(AND(N15>0,N16>0),IF(OR(N15>10,N15<0,N16>10,N16<0),\"Fehler\",IF(ABS(L15)-ABS(M15)-(N15+N16)/2+10>0,IF(L15<0,-(ABS(L15)-ABS(M15)-(N15+N16)/2+10),L15-ABS(M15)-(N15+N16)/2+10),0)),0)","v":0},5,null,2.7,{"$f":"IF(AND(R15>0,R16>0),IF(OR(R15>10,R15<0,R16>10,R16<0),\"Fehler\",IF(ABS(P15)-ABS(Q15)-(R15+R16)/2+10>0,IF(P15<0,-(ABS(P15)-ABS(Q15)-(R15+R16)/2+10),P15-ABS(Q15)-(R15+R16)/2+10),0)),0)","v":12.3},4,null,3.2,{"$f":"IF(AND(V15>0,V16>0),IF(OR(V15>10,V15<0,V16>10,V16<0),\"Fehler\",IF(ABS(T15)-ABS(U15)-(V15+V16)/2+10>0,IF(T15<0,-(ABS(T15)-ABS(U15)-(V15+V16)/2+10),T15-ABS(U15)-(V15+V16)/2+10),0)),0)","v":10.7},3,null,2.8,{"$f":"IF(AND(Z15>0,Z16>0),IF(OR(Z15>10,Z15<0,Z16>10,Z16<0),\"Fehler\",IF(ABS(X15)-ABS(Y15)-(Z15+Z16)/2+10>0,IF(X15<0,-(ABS(X15)-ABS(Y15)-(Z15+Z16)/2+10),X15-ABS(Y15)-(Z15+Z16)/2+10),0)),0)","v":10.199999999999999},{"$f":"ABS(G15)+ABS(K15)+ABS(O15)+ABS(S15)+ABS(W15)+ABS(AA15)","v":52.400000000000006},null,null,null,"Barren",{"$f":"IF(W40>1,1,0)","v":1}]
[null,null,null,null,null,2.5,null,null,null,3.3,null,null,null,null,null,null,null,2.7,null,null,null,3.4,null,null,null,2.8,null,null,null,null,null,"Reck",{"$f":"IF(AA40>1,1,0)","v":1}]
[{"$f":"'Wertungszettel M3'!A15","v":"Bennett Hasenfuß"},{"$f":"IF(A17>0,B15,\"\")","v":"TG LaPeKa"},{"$f":"IF(A17<>\"\", VLOOKUP(A17,'Wertungszettel M3'!A$7:B$40,2,0),\"\")","v":0},3,null,2.1,{"$f":"IF(AND(F17>0,F18>0),IF(OR(F17>10,F17<0,F18>10,F18<0),\"Fehler\",IF(ABS(D17)-ABS(E17)-(F17+F18)/2+10>0,IF(D17<0,-(ABS(D17)-ABS(E17)-(F17+F18)/2+10),D17-ABS(E17)-(F17+F18)/2+10),0)),0)","v":10.8},3,null,2.4,{"$f":"IF(AND(J17>0,J18>0),IF(OR(J17>10,J17<0,J18>10,J18<0),\"Fehler\",IF(ABS(H17)-ABS(I17)-(J17+J18)/2+10>0,IF(H17<0,-(ABS(H17)-ABS(I17)-(J17+J18)/2+10),H17-ABS(I17)-(J17+J18)/2+10),0)),0)","v":10.6},4,2.5,4,{"$f":"IF(AND(N17>0,N18>0),IF(OR(N17>10,N17<0,N18>10,N18<0),\"Fehler\",IF(ABS(L17)-ABS(M17)-(N17+N18)/2+10>0,IF(L17<0,-(ABS(L17)-ABS(M17)-(N17+N18)/2+10),L17-ABS(M17)-(N17+N18)/2+10),0)),0)","v":7.5},5,null,2.2000000000000002,{"$f":"IF(AND(R17>0,R18>0),IF(OR(R17>10,R17<0,R18>10,R18<0),\"Fehler\",IF(ABS(P17)-ABS(Q17)-(R17+R18)/2+10>0,IF(P17<0,-(ABS(P17)-ABS(Q17)-(R17+R18)/2+10),P17-ABS(Q17)-(R17+R18)/2+10),0)),0)","v":12.9},3,null,1.8,{"$f":"IF(AND(V17>0,V18>0),IF(OR(V17>10,V17<0,V18>10,V18<0),\"Fehler\",IF(ABS(T17)-ABS(U17)-(V17+V18)/2+10>0,IF(T17<0,-(ABS(T17)-ABS(U17)-(V17+V18)/2+10),T17-ABS(U17)-(V17+V18)/2+10),0)),0)","v":11.3},3,null,3.5,{"$f":"IF(AND(Z17>0,Z18>0),IF(OR(Z17>10,Z17<0,Z18>10,Z18<0),\"Fehler\",IF(ABS(X17)-ABS(Y17)-(Z17+Z18)/2+10>0,IF(X17<0,-(ABS(X17)-ABS(Y17)-(Z17+Z18)/2+10),X17-ABS(Y17)-(Z17+Z18)/2+10),0)),0)","v":9.5500000000000007},{"$f":"ABS(G17)+ABS(K17)+ABS(O17)+ABS(S17)+ABS(W17)+ABS(AA17)","v":62.649999999999991}]
[null,null,null,null,null,2.2999999999999998,null,null,null,2.4,null,null,null,4,null,null,null,2,null,null,null,1.6,null,null,null,3.4,null,null,null,null,null,"Gesamt",{"$f":"SUM(AG11:AG17)","v":6}]
[{"$f":"'Wertungszettel M3'!A17","v":"Jaroslaw Schwentner"},{"$f":"IF(A19>0,B17,\"\")","v":"TG LaPeKa"},{"$f":"IF(A19<>\"\", VLOOKUP(A19,'Wertungszettel M3'!A$7:B$40,2,0),\"\")","v":0},3,null,1.6,{"$f":"IF(AND(F19>0,F20>0),IF(OR(F19>10,F19<0,F20>10,F20<0),\"Fehler\",IF(ABS(D19)-ABS(E19)-(F19+F20)/2+10>0,IF(D19<0,-(ABS(D19)-ABS(E19)-(F19+F20)/2+10),D19-ABS(E19)-(F19+F20)/2+10),0)),0)","v":11.4},3,null,1.6,{"$f":"IF(AND(J19>0,J20>0),IF(OR(J19>10,J19<0,J20>10,J20<0),\"Fehler\",IF(ABS(H19)-ABS(I19)-(J19+J20)/2+10>0,IF(H19<0,-(ABS(H19)-ABS(I19)-(J19+J20)/2+10),H19-ABS(I19)-(J19+J20)/2+10),0)),0)","v":11.4},3,null,3.8,{"$f":"IF(AND(N19>0,N20>0),IF(OR(N19>10,N19<0,N20>10,N20<0),\"Fehler\",IF(ABS(L19)-ABS(M19)-(N19+N20)/2+10>0,IF(L19<0,-(ABS(L19)-ABS(M19)-(N19+N20)/2+10),L19-ABS(M19)-(N19+N20)/2+10),0)),0)","v":9.1999999999999993},5,null,1.9,{"$f":"IF(AND(R19>0,R20>0),IF(OR(R19>10,R19<0,R20>10,R20<0),\"Fehler\",IF(ABS(P19)-ABS(Q19)-(R19+R20)/2+10>0,IF(P19<0,-(ABS(P19)-ABS(Q19)-(R19+R20)/2+10),P19-ABS(Q19)-(R19+R20)/2+10),0)),0)","v":13.2},4,0.5,2.6,{"$f":"IF(AND(V19>0,V20>0),IF(OR(V19>10,V19<0,V20>10,V20<0),\"Fehler\",IF(ABS(T19)-ABS(U19)-(V19+V20)/2+10>0,IF(T19<0,-(ABS(T19)-ABS(U19)-(V19+V20)/2+10),T19-ABS(U19)-(V19+V20)/2+10),0)),0)","v":10.9},3,null,2.5,{"$f":"IF(AND(Z19>0,Z20>0),IF(OR(Z19>10,Z19<0,Z20>10,Z20<0),\"Fehler\",IF(ABS(X19)-ABS(Y19)-(Z19+Z20)/2+10>0,IF(X19<0,-(ABS(X19)-ABS(Y19)-(Z19+Z20)/2+10),X19-ABS(Y19)-(Z19+Z20)/2+10),0)),0)","v":10.65},{"$f":"ABS(G19)+ABS(K19)+ABS(O19)+ABS(S19)+ABS(W19)+ABS(AA19)","v":66.75}]
[null,null,null,null,null,1.6,null,null,null,1.6,null,null,null,3.8,null,null,null,1.7,null,null,null,2.6,null,null,null,2.2000000000000002]
[{"$f":"'Wertungszettel M3'!A19","v":"frei 7"},{"$f":"IF(A21>0,B19,\"\")","v":"TG LaPeKa"},{"$f":"IF(A21<>\"\", VLOOKUP(A21,'Wertungszettel M3'!A$7:B$40,2,0),\"\")","v":0},null,null,null,{"$f":"IF(AND(F21>0,F22>0),IF(OR(F21>10,F21<0,F22>10,F22<0),\"Fehler\",IF(ABS(D21)-ABS(E21)-(F21+F22)/2+10>0,IF(D21<0,-(ABS(D21)-ABS(E21)-(F21+F22)/2+10),D21-ABS(E21)-(F21+F22)/2+10),0)),0)","v":0},null,null,null,{"$f":"IF(AND(J21>0,J22>0),IF(OR(J21>10,J21<0,J22>10,J22<0),\"Fehler\",IF(ABS(H21)-ABS(I21)-(J21+J22)/2+10>0,IF(H21<0,-(ABS(H21)-ABS(I21)-(J21+J22)/2+10),H21-ABS(I21)-(J21+J22)/2+10),0)),0)","v":0},null,null,null,{"$f":"IF(AND(N21>0,N22>0),IF(OR(N21>10,N21<0,N22>10,N22<0),\"Fehler\",IF(ABS(L21)-ABS(M21)-(N21+N22)/2+10>0,IF(L21<0,-(ABS(L21)-ABS(M21)-(N21+N22)/2+10),L21-ABS(M21)-(N21+N22)/2+10),0)),0)","v":0},null,null,null,{"$f":"IF(AND(R21>0,R22>0),IF(OR(R21>10,R21<0,R22>10,R22<0),\"Fehler\",IF(ABS(P21)-ABS(Q21)-(R21+R22)/2+10>0,IF(P21<0,-(ABS(P21)-ABS(Q21)-(R21+R22)/2+10),P21-ABS(Q21)-(R21+R22)/2+10),0)),0)","v":0},null,null,null,{"$f":"IF(AND(V21>0,V22>0),IF(OR(V21>10,V21<0,V22>10,V22<0),\"Fehler\",IF(ABS(T21)-ABS(U21)-(V21+V22)/2+10>0,IF(T21<0,-(ABS(T21)-ABS(U21)-(V21+V22)/2+10),T21-ABS(U21)-(V21+V22)/2+10),0)),0)","v":0},null,null,null,{"$f":"IF(AND(Z21>0,Z22>0),IF(OR(Z21>10,Z21<0,Z22>10,Z22<0),\"Fehler\",IF(ABS(X21)-ABS(Y21)-(Z21+Z22)/2+10>0,IF(X21<0,-(ABS(X21)-ABS(Y21)-(Z21+Z22)/2+10),X21-ABS(Y21)-(Z21+Z22)/2+10),0)),0)","v":0},{"$f":"ABS(G21)+ABS(K21)+ABS(O21)+ABS(S21)+ABS(W21)+ABS(AA21)","v":0}]
[]
[{"$f":"'Wertungszettel M3'!A21","v":"frei 8"},{"$f":"IF(A23>0,B21,\"\")","v":"TG LaPeKa"},{"$f":"IF(A23<>\"\", VLOOKUP(A23,'Wertungszettel M3'!A$7:B$40,2,0),\"\")","v":0},null,null,null,{"$f":"IF(AND(F23>0,F24>0),IF(OR(F23>10,F23<0,F24>10,F24<0),\"Fehler\",IF(ABS(D23)-ABS(E23)-(F23+F24)/2+10>0,IF(D23<0,-(ABS(D23)-ABS(E23)-(F23+F24)/2+10),D23-ABS(E23)-(F23+F24)/2+10),0)),0)","v":0},null,null,null,{"$f":"IF(AND(J23>0,J24>0),IF(OR(J23>10,J23<0,J24>10,J24<0),\"Fehler\",IF(ABS(H23)-ABS(I23)-(J23+J24)/2+10>0,IF(H23<0,-(ABS(H23)-ABS(I23)-(J23+J24)/2+10),H23-ABS(I23)-(J23+J24)/2+10),0)),0)","v":0},null,null,null,{"$f":"IF(AND(N23>0,N24>0),IF(OR(N23>10,N23<0,N24>10,N24<0),\"Fehler\",IF(ABS(L23)-ABS(M23)-(N23+N24)/2+10>0,IF(L23<0,-(ABS(L23)-ABS(M23)-(N23+N24)/2+10),L23-ABS(M23)-(N23+N24)/2+10),0)),0)","v":0},null,null,null,{"$f":"IF(AND(R23>0,R24>0),IF(OR(R23>10,R23<0,R24>10,R24<0),\"Fehler\",IF(ABS(P23)-ABS(Q23)-(R23+R24)/2+10>0,IF(P23<0,-(ABS(P23)-ABS(Q23)-(R23+R24)/2+10),P23-ABS(Q23)-(R23+R24)/2+10),0)),0)","v":0},null,null,null,{"$f":"IF(AND(V23>0,V24>0),IF(OR(V23>10,V23<0,V24>10,V24<0),\"Fehler\",IF(ABS(T23)-ABS(U23)-(V23+V24)/2+10>0,IF(T23<0,-(ABS(T23)-ABS(U23)-(V23+V24)/2+10),T23-ABS(U23)-(V23+V24)/2+10),0)),0)","v":0},null,null,null,{"$f":"IF(AND(Z23>0,Z24>0),IF(OR(Z23>10,Z23<0,Z24>10,Z24<0),\"Fehler\",IF(ABS(X23)-ABS(Y23)-(Z23+Z24)/2+10>0,IF(X23<0,-(ABS(X23)-ABS(Y23)-(Z23+Z24)/2+10),X23-ABS(Y23)-(Z23+Z24)/2+10),0)),0)","v":0},{"$f":"ABS(G23)+ABS(K23)+ABS(O23)+ABS(S23)+ABS(W23)+ABS(AA23)","v":0}]
[]
[{"$f":"'Wertungszettel M3'!A23","v":"frei 9"},{"$f":"IF(A25>0,B23,\"\")","v":"TG LaPeKa"},{"$f":"IF(A25<>\"\", VLOOKUP(A25,'Wertungszettel M3'!A$7:B$40,2,0),\"\")","v":0},null,null,null,{"$f":"IF(AND(F25>0,F26>0),IF(OR(F25>10,F25<0,F26>10,F26<0),\"Fehler\",IF(ABS(D25)-ABS(E25)-(F25+F26)/2+10>0,IF(D25<0,-(ABS(D25)-ABS(E25)-(F25+F26)/2+10),D25-ABS(E25)-(F25+F26)/2+10),0)),0)","v":0},null,null,null,{"$f":"IF(AND(J25>0,J26>0),IF(OR(J25>10,J25<0,J26>10,J26<0),\"Fehler\",IF(ABS(H25)-ABS(I25)-(J25+J26)/2+10>0,IF(H25<0,-(ABS(H25)-ABS(I25)-(J25+J26)/2+10),H25-ABS(I25)-(J25+J26)/2+10),0)),0)","v":0},null,null,null,{"$f":"IF(AND(N25>0,N26>0),IF(OR(N25>10,N25<0,N26>10,N26<0),\"Fehler\",IF(ABS(L25)-ABS(M25)-(N25+N26)/2+10>0,IF(L25<0,-(ABS(L25)-ABS(M25)-(N25+N26)/2+10),L25-ABS(M25)-(N25+N26)/2+10),0)),0)","v":0},null,null,null,{"$f":"IF(AND(R25>0,R26>0),IF(OR(R25>10,R25<0,R26>10,R26<0),\"Fehler\",IF(ABS(P25)-ABS(Q25)-(R25+R26)/2+10>0,IF(P25<0,-(ABS(P25)-ABS(Q25)-(R25+R26)/2+10),P25-ABS(Q25)-(R25+R26)/2+10),0)),0)","v":0},null,null,null,{"$f":"IF(AND(V25>0,V26>0),IF(OR(V25>10,V25<0,V26>10,V26<0),\"Fehler\",IF(ABS(T25)-ABS(U25)-(V25+V26)/2+10>0,IF(T25<0,-(ABS(T25)-ABS(U25)-(V25+V26)/2+10),T25-ABS(U25)-(V25+V26)/2+10),0)),0)","v":0},null,null,null,{"$f":"IF(AND(Z25>0,Z26>0),IF(OR(Z25>10,Z25<0,Z26>10,Z26<0),\"Fehler\",IF(ABS(X25)-ABS(Y25)-(Z25+Z26)/2+10>0,IF(X25<0,-(ABS(X25)-ABS(Y25)-(Z25+Z26)/2+10),X25-ABS(Y25)-(Z25+Z26)/2+10),0)),0)","v":0},{"$f":"ABS(G25)+ABS(K25)+ABS(O25)+ABS(S25)+ABS(W25)+ABS(AA25)","v":0}]
[]
[{"$f":"'Wertungszettel M3'!A25","v":"frei 10"},{"$f":"IF(A27>0,B25,\"\")","v":"TG LaPeKa"},{"$f":"IF(A27<>\"\", VLOOKUP(A27,'Wertungszettel M3'!A$7:B$40,2,0),\"\")","v":0},null,null,null,{"$f":"IF(AND(F27>0,F28>0),IF(OR(F27>10,F27<0,F28>10,F28<0),\"Fehler\",IF(ABS(D27)-ABS(E27)-(F27+F28)/2+10>0,IF(D27<0,-(ABS(D27)-ABS(E27)-(F27+F28)/2+10),D27-ABS(E27)-(F27+F28)/2+10),0)),0)","v":0},null,null,null,{"$f":"IF(AND(J27>0,J28>0),IF(OR(J27>10,J27<0,J28>10,J28<0),\"Fehler\",IF(ABS(H27)-ABS(I27)-(J27+J28)/2+10>0,IF(H27<0,-(ABS(H27)-ABS(I27)-(J27+J28)/2+10),H27-ABS(I27)-(J27+J28)/2+10),0)),0)","v":0},null,null,null,{"$f":"IF(AND(N27>0,N28>0),IF(OR(N27>10,N27<0,N28>10,N28<0),\"Fehler\",IF(ABS(L27)-ABS(M27)-(N27+N28)/2+10>0,IF(L27<0,-(ABS(L27)-ABS(M27)-(N27+N28)/2+10),L27-ABS(M27)-(N27+N28)/2+10),0)),0)","v":0},null,null,null,{"$f":"IF(AND(R27>0,R28>0),IF(OR(R27>10,R27<0,R28>10,R28<0),\"Fehler\",IF(ABS(P27)-ABS(Q27)-(R27+R28)/2+10>0,IF(P27<0,-(ABS(P27)-ABS(Q27)-(R27+R28)/2+10),P27-ABS(Q27)-(R27+R28)/2+10),0)),0)","v":0},null,null,null,{"$f":"IF(AND(V27>0,V28>0),IF(OR(V27>10,V27<0,V28>10,V28<0),\"Fehler\",IF(ABS(T27)-ABS(U27)-(V27+V28)/2+10>0,IF(T27<0,-(ABS(T27)-ABS(U27)-(V27+V28)/2+10),T27-ABS(U27)-(V27+V28)/2+10),0)),0)","v":0},null,null,null,{"$f":"IF(AND(Z27>0,Z28>0),IF(OR(Z27>10,Z27<0,Z28>10,Z28<0),\"Fehler\",IF(ABS(X27)-ABS(Y27)-(Z27+Z28)/2+10>0,IF(X27<0,-(ABS(X27)-ABS(Y27)-(Z27+Z28)/2+10),X27-ABS(Y27)-(Z27+Z28)/2+10),0)),0)","v":0},{"$f":"ABS(G27)+ABS(K27)+ABS(O27)+ABS(S27)+ABS(W27)+ABS(AA27)","v":0}]
[]
[{"$f":"'Wertungszettel M3'!A27","v":"frei 11"},{"$f":"IF(A29>0,B27,\"\")","v":"TG LaPeKa"},{"$f":"IF(A29<>\"\", VLOOKUP(A29,'Wertungszettel M3'!A$7:B$40,2,0),\"\")","v":0},null,null,null,{"$f":"IF(AND(F29>0,F30>0),IF(OR(F29>10,F29<0,F30>10,F30<0),\"Fehler\",IF(ABS(D30)-ABS(E30)-(F29+F30)/2+10>0,IF(D30<0,-(ABS(D30)-ABS(E30)-(F29+F30)/2+10),D29-ABS(E29)-(F29+F30)/2+10),0)),0)","v":0},null,null,null,{"$f":"IF(AND(J29>0,J30>0),IF(OR(J29>10,J29<0,J30>10,J30<0),\"Fehler\",IF(ABS(H30)-ABS(I30)-(J29+J30)/2+10>0,IF(H30<0,-(ABS(H30)-ABS(I30)-(J29+J30)/2+10),H29-ABS(I29)-(J29+J30)/2+10),0)),0)","v":0},null,null,null,{"$f":"IF(AND(N29>0,N30>0),IF(OR(N29>10,N29<0,N30>10,N30<0),\"Fehler\",IF(ABS(L30)-ABS(M30)-(N29+N30)/2+10>0,IF(L30<0,-(ABS(L30)-ABS(M30)-(N29+N30)/2+10),L29-ABS(M29)-(N29+N30)/2+10),0)),0)","v":0},null,null,null,{"$f":"IF(AND(R29>0,R30>0),IF(OR(R29>10,R29<0,R30>10,R30<0),\"Fehler\",IF(ABS(P30)-ABS(Q30)-(R29+R30)/2+10>0,IF(P30<0,-(ABS(P30)-ABS(Q30)-(R29+R30)/2+10),P29-ABS(Q29)-(R29+R30)/2+10),0)),0)","v":0},null,null,null,{"$f":"IF(AND(V29>0,V30>0),IF(OR(V29>10,V29<0,V30>10,V30<0),\"Fehler\",IF(ABS(T30)-ABS(U30)-(V29+V30)/2+10>0,IF(T30<0,-(ABS(T30)-ABS(U30)-(V29+V30)/2+10),T29-ABS(U29)-(V29+V30)/2+10),0)),0)","v":0},null,null,null,{"$f":"IF(AND(Z29>0,Z30>0),IF(OR(Z29>10,Z29<0,Z30>10,Z30<0),\"Fehler\",IF(ABS(X30)-ABS(Y30)-(Z29+Z30)/2+10>0,IF(X30<0,-(ABS(X30)-ABS(Y30)-(Z29+Z30)/2+10),X29-ABS(Y29)-(Z29+Z30)/2+10),0)),0)","v":0},{"$f":"ABS(G29)+ABS(K29)+ABS(O29)+ABS(S29)+ABS(W29)+ABS(AA29)","v":0}]
[]
[{"$f":"'Wertungszettel M3'!A29","v":"frei 12"},{"$f":"IF(A31>0,B29,\"\")","v":"TG LaPeKa"},{"$f":"IF(A31<>\"\", VLOOKUP(A31,'Wertungszettel M3'!A$7:B$40,2,0),\"\")","v":0},null,null,null,{"$f":"IF(AND(F31>0,F32>0),IF(OR(F31>10,F31<0,F32>10,F32<0),\"Fehler\",IF(ABS(D32)-ABS(E32)-(F31+F32)/2+10>0,IF(D32<0,-(ABS(D32)-ABS(E32)-(F31+F32)/2+10),D31-ABS(E31)-(F31+F32)/2+10),0)),0)","v":0},null,null,null,{"$f":"IF(AND(J31>0,J32>0),IF(OR(J31>10,J31<0,J32>10,J32<0),\"Fehler\",IF(ABS(H32)-ABS(I32)-(J31+J32)/2+10>0,IF(H32<0,-(ABS(H32)-ABS(I32)-(J31+J32)/2+10),H31-ABS(I31)-(J31+J32)/2+10),0)),0)","v":0},null,null,null,{"$f":"IF(AND(N31>0,N32>0),IF(OR(N31>10,N31<0,N32>10,N32<0),\"Fehler\",IF(ABS(L32)-ABS(M32)-(N31+N32)/2+10>0,IF(L32<0,-(ABS(L32)-ABS(M32)-(N31+N32)/2+10),L31-ABS(M31)-(N31+N32)/2+10),0)),0)","v":0},null,null,null,{"$f":"IF(AND(R31>0,R32>0),IF(OR(R31>10,R31<0,R32>10,R32<0),\"Fehler\",IF(ABS(P32)-ABS(Q32)-(R31+R32)/2+10>0,IF(P32<0,-(ABS(P32)-ABS(Q32)-(R31+R32)/2+10),P31-ABS(Q31)-(R31+R32)/2+10),0)),0)","v":0},null,null,null,{"$f":"IF(AND(V31>0,V32>0),IF(OR(V31>10,V31<0,V32>10,V32<0),\"Fehler\",IF(ABS(T32)-ABS(U32)-(V31+V32)/2+10>0,IF(T32<0,-(ABS(T32)-ABS(U32)-(V31+V32)/2+10),T31-ABS(U31)-(V31+V32)/2+10),0)),0)","v":0},null,null,null,{"$f":"IF(AND(Z31>0,Z32>0),IF(OR(Z31>10,Z31<0,Z32>10,Z32<0),\"Fehler\",IF(ABS(X32)-ABS(Y32)-(Z31+Z32)/2+10>0,IF(X32<0,-(ABS(X32)-ABS(Y32)-(Z31+Z32)/2+10),X31-ABS(Y31)-(Z31+Z32)/2+10),0)),0)","v":0},{"$f":"ABS(G31)+ABS(K31)+ABS(O31)+ABS(S31)+ABS(W31)+ABS(AA31)","v":0}]
[]
[{"$f":"'Wertungszettel M3'!A31","v":"frei 13"},{"$f":"IF(A33>0,B31,\"\")","v":"TG LaPeKa"},{"$f":"IF(A33<>\"\", VLOOKUP(A33,'Wertungszettel M3'!A$7:B$40,2,0),\"\")","v":0},null,null,null,{"$f":"IF(AND(F33>0,F34>0),IF(OR(F33>10,F33<0,F34>10,F34<0),\"Fehler\",IF(ABS(D34)-ABS(E34)-(F33+F34)/2+10>0,IF(D34<0,-(ABS(D34)-ABS(E34)-(F33+F34)/2+10),D33-ABS(E33)-(F33+F34)/2+10),0)),0)","v":0},null,null,null,{"$f":"IF(AND(J33>0,J34>0),IF(OR(J33>10,J33<0,J34>10,J34<0),\"Fehler\",IF(ABS(H34)-ABS(I34)-(J33+J34)/2+10>0,IF(H34<0,-(ABS(H34)-ABS(I34)-(J33+J34)/2+10),H33-ABS(I33)-(J33+J34)/2+10),0)),0)","v":0},null,null,null,{"$f":"IF(AND(N33>0,N34>0),IF(OR(N33>10,N33<0,N34>10,N34<0),\"Fehler\",IF(ABS(L34)-ABS(M34)-(N33+N34)/2+10>0,IF(L34<0,-(ABS(L34)-ABS(M34)-(N33+N34)/2+10),L33-ABS(M33)-(N33+N34)/2+10),0)),0)","v":0},null,null,null,{"$f":"IF(AND(R33>0,R34>0),IF(OR(R33>10,R33<0,R34>10,R34<0),\"Fehler\",IF(ABS(P34)-ABS(Q34)-(R33+R34)/2+10>0,IF(P34<0,-(ABS(P34)-ABS(Q34)-(R33+R34)/2+10),P33-ABS(Q33)-(R33+R34)/2+10),0)),0)","v":0},null,null,null,{"$f":"IF(AND(V33>0,V34>0),IF(OR(V33>10,V33<0,V34>10,V34<0),\"Fehler\",IF(ABS(T34)-ABS(U34)-(V33+V34)/2+10>0,IF(T34<0,-(ABS(T34)-ABS(U34)-(V33+V34)/2+10),T33-ABS(U33)-(V33+V34)/2+10),0)),0)","v":0},null,null,null,{"$f":"IF(AND(Z33>0,Z34>0),IF(OR(Z33>10,Z33<0,Z34>10,Z34<0),\"Fehler\",IF(ABS(X34)-ABS(Y34)-(Z33+Z34)/2+10>0,IF(X34<0,-(ABS(X34)-ABS(Y34)-(Z33+Z34)/2+10),X33-ABS(Y33)-(Z33+Z34)/2+10),0)),0)","v":0},{"$f":"ABS(G33)+ABS(K33)+ABS(O33)+ABS(S33)+ABS(W33)+ABS(AA33)","v":0}]
[]
[{"$f":"'Wertungszettel M3'!A33","v":"frei 14"},{"$f":"IF(A35>0,B33,\"\")","v":"TG LaPeKa"},{"$f":"IF(A35<>\"\", VLOOKUP(A35,'Wertungszettel M3'!A$7:B$40,2,0),\"\")","v":0},null,null,null,{"$f":"IF(AND(F35>0,F36>0),IF(OR(F35>10,F35<0,F36>10,F36<0),\"Fehler\",IF(ABS(D36)-ABS(E36)-(F35+F36)/2+10>0,IF(D36<0,-(ABS(D36)-ABS(E36)-(F35+F36)/2+10),D35-ABS(E35)-(F35+F36)/2+10),0)),0)","v":0},null,null,null,{"$f":"IF(AND(J35>0,J36>0),IF(OR(J35>10,J35<0,J36>10,J36<0),\"Fehler\",IF(ABS(H36)-ABS(I36)-(J35+J36)/2+10>0,IF(H36<0,-(ABS(H36)-ABS(I36)-(J35+J36)/2+10),H35-ABS(I35)-(J35+J36)/2+10),0)),0)","v":0},null,null,null,{"$f":"IF(AND(N35>0,N36>0),IF(OR(N35>10,N35<0,N36>10,N36<0),\"Fehler\",IF(ABS(L36)-ABS(M36)-(N35+N36)/2+10>0,IF(L36<0,-(ABS(L36)-ABS(M36)-(N35+N36)/2+10),L35-ABS(M35)-(N35+N36)/2+10),0)),0)","v":0},null,null,null,{"$f":"IF(AND(R35>0,R36>0),IF(OR(R35>10,R35<0,R36>10,R36<0),\"Fehler\",IF(ABS(P36)-ABS(Q36)-(R35+R36)/2+10>0,IF(P36<0,-(ABS(P36)-ABS(Q36)-(R35+R36)/2+10),P35-ABS(Q35)-(R35+R36)/2+10),0)),0)","v":0},null,null,null,{"$f":"IF(AND(V35>0,V36>0),IF(OR(V35>10,V35<0,V36>10,V36<0),\"Fehler\",IF(ABS(T36)-ABS(U36)-(V35+V36)/2+10>0,IF(T36<0,-(ABS(T36)-ABS(U36)-(V35+V36)/2+10),T35-ABS(U35)-(V35+V36)/2+10),0)),0)","v":0},null,null,null,{"$f":"IF(AND(Z35>0,Z36>0),IF(OR(Z35>10,Z35<0,Z36>10,Z36<0),\"Fehler\",IF(ABS(X36)-ABS(Y36)-(Z35+Z36)/2+10>0,IF(X36<0,-(ABS(X36)-ABS(Y36)-(Z35+Z36)/2+10),X35-ABS(Y35)-(Z35+Z36)/2+10),0)),0)","v":0},{"$f":"ABS(G35)+ABS(K35)+ABS(O35)+ABS(S35)+ABS(W35)+ABS(AA35)","v":0}]
[]
[{"$f":"'Wertungszettel M3'!A35","v":"frei 15"},{"$f":"IF(A37>0,B35,\"\")","v":"TG LaPeKa"},{"$f":"IF(A37<>\"\", VLOOKUP(A37,'Wertungszettel M3'!A$7:B$40,2,0),\"\")","v":0},null,null,null,{"$f":"IF(AND(F37>0,F38>0),IF(OR(F37>10,F37<0,F38>10,F38<0),\"Fehler\",IF(ABS(D38)-ABS(E38)-(F37+F38)/2+10>0,IF(D38<0,-(ABS(D38)-ABS(E38)-(F37+F38)/2+10),D37-ABS(E37)-(F37+F38)/2+10),0)),0)","v":0},null,null,null,{"$f":"IF(AND(J37>0,J38>0),IF(OR(J37>10,J37<0,J38>10,J38<0),\"Fehler\",IF(ABS(H38)-ABS(I38)-(J37+J38)/2+10>0,IF(H38<0,-(ABS(H38)-ABS(I38)-(J37+J38)/2+10),H37-ABS(I37)-(J37+J38)/2+10),0)),0)","v":0},null,null,null,{"$f":"IF(AND(N37>0,N38>0),IF(OR(N37>10,N37<0,N38>10,N38<0),\"Fehler\",IF(ABS(L38)-ABS(M38)-(N37+N38)/2+10>0,IF(L38<0,-(ABS(L38)-ABS(M38)-(N37+N38)/2+10),L37-ABS(M37)-(N37+N38)/2+10),0)),0)","v":0},null,null,null,{"$f":"IF(AND(R37>0,R38>0),IF(OR(R37>10,R37<0,R38>10,R38<0),\"Fehler\",IF(ABS(P38)-ABS(Q38)-(R37+R38)/2+10>0,IF(P38<0,-(ABS(P38)-ABS(Q38)-(R37+R38)/2+10),P37-ABS(Q37)-(R37+R38)/2+10),0)),0)","v":0},null,null,null,{"$f":"IF(AND(V37>0,V38>0),IF(OR(V37>10,V37<0,V38>10,V38<0),\"Fehler\",IF(ABS(T38)-ABS(U38)-(V37+V38)/2+10>0,IF(T38<0,-(ABS(T38)-ABS(U38)-(V37+V38)/2+10),T37-ABS(U37)-(V37+V38)/2+10),0)),0)","v":0},null,null,null,{"$f":"IF(AND(Z37>0,Z38>0),IF(OR(Z37>10,Z37<0,Z38>10,Z38<0),\"Fehler\",IF(ABS(X38)-ABS(Y38)-(Z37+Z38)/2+10>0,IF(X38<0,-(ABS(X38)-ABS(Y38)-(Z37+Z38)/2+10),X37-ABS(Y37)-(Z37+Z38)/2+10),0)),0)","v":0},{"$f":"ABS(G37)+ABS(K37)+ABS(O37)+ABS(S37)+ABS(W37)+ABS(AA37)","v":0}]
[]
[]
[null,null,null,null,null,null,{"$f":"SUM(LARGE(G9:G38,1),LARGE(G9:G38,2),LARGE(G9:G38,3))","v":32.450000000000003},null,null,null,{"$f":"SUM(LARGE(K9:K38,1),LARGE(K9:K38,2),LARGE(K9:K38,3))","v":31.7},null,null,null,{"$f":"SUM(LARGE(O9:O38,1),LARGE(O9:O38,2),LARGE(O9:O38,3))","v":27.5},null,null,null,{"$f":"SUM(LARGE(S9:S38,1),LARGE(S9:S38,2),LARGE(S9:S38,3))","v":39.4},null,null,null,{"$f":"SUM(LARGE(W9:W38,1),LARGE(W9:W38,2),LARGE(W9:W38,3))","v":34},null,null,null,{"$f":"SUM(LARGE(AA9:AA38,1),LARGE(AA9:AA38,2),LARGE(AA9:AA38,3))","v":32.549999999999997},{"$f":"SUM(G40,K40,O40,S40,W40,AA40)","v":197.60000000000002}]

{"sheet":"Dielmissen","index":7,"n_rows":40,"n_cols":33,"rows_kept":40,"cut":false,"hidden":false,"merged":[[36,26,37,26],[36,27,37,27],[34,23,35,23],[34,24,35,24],[34,26,35,26],[34,27,35,27],[36,0,37,0],[36,1,37,1],[36,2,37,2],[36,3,37,3],[36,4,37,4],[36,6,37,6],[36,7,37,7],[36,8,37,8],[36,10,37,10],[36,11,37,11],[36,12,37,12],[36,14,37,14],[36,15,37,15],[36,16,37,16],[36,18,37,18],[36,19,37,19],[36,20,37,20],[36,22,37,22],[36,23,37,23],[36,24,37,24],[34,11,35,11],[34,12,35,12],[34,14,35,14],[34,15,35,15],[34,16,35,16],[34,18,35,18],[34,19,35,19],[34,20,35,20],[34,22,35,22],[34,0,35,0],[34,1,35,1],[34,2,35,2],[34,3,35,3],[34,4,35,4],[34,6,35,6],[34,7,35,7],[34,8,35,8],[34,10,35,10],[30,26,31,26],[30,27,31,27],[32,0,33,0],[32,1,33,1],[32,2,33,2],[32,3,33,3],[32,4,33,4],[32,6,33,6],[32,7,33,7],[32,8,33,8],[32,10,33,10],[32,11,33,11],[32,12,33,12],[32,14,33,14],[32,15,33,15],[32,16,33,16],[32,18,33,18],[32,19,33,19],[32,20,33,20],[32,22,33,22],[32,23,33,23],[32,24,33,24],[32,26,33,26],[32,27,33,27],[28,23,29,23],[28,24,29,24],[28,26,29,26],[28,27,29,27],[30,0,31,0],[30,1,31,1],[30,2,31,2],[30,3,31,3],[30,4,31,4],[30,6,31,6],[30,7,31,7],[30,8,31,8],[30,10,31,10],[30,11,31,11],[30,12,31,12],[30,14,31,14],[30,15,31,15],[30,16,31,16],[30,18,31,18],[30,19,31,19],[30,20,31,20],[30,22,31,22],[30,23,31,23],[30,24,31,24],[28,11,29,11],[28,12,29,12],[28,14,29,14],[28,15,29,15],[28,16,29,16],[28,18,29,18],[28,19,29,19],[28,20,29,20],[28,22,29,22],[28,0,29,0],[28,1,29,1],[28,2,29,2],[28,3,29,3],[28,4,29,4],[28,6,29,6],[28,7,29,7],[28,8,29,8],[28,10,29,10],[26,0,27,0],[26,1,27,1],[26,2,27,2],[26,3,27,3],[26,4,27,4],[26,6,27,6],[26,7,27,7],[26,8,27,8],[20,0,21,0],[20,1,21,1],[20,2,21,2],[20,3,21,3],[24,0,25,0],[24,1,25,1],[24,2,25,2],[24,3,25,3],[24,4,25,4],[24,6,25,6],[20,4,21,4],[20,6,21,6],[20,7,21,7],[20,8,21,8],[26,10,27,10],[26,11,27,11],[26,12,27,12],[26,14,27,14],[26,15,27,15],[26,16,27,16],[2,14,2,16],[0,14,0,16],[10,15,11,15],[12,10,13,10],[20,16,21,16],[12,11,13,11],[24,24,25,24],[24,26,25,26],[26,26,27,26],[24,27,25,27],[24,12,25,12],[24,14,25,14],[24,15,25,15],[24,16,25,16],[24,18,25,18],[24,19,25,19],[26,27,27,27],[26,22,27,22],[26,23,27,23],[26,24,27,24],[24,20,25,20],[26,18,27,18],[26,19,27,19],[26,20,27,20],[22,22,23,22],[22,7,23,7],[22,8,23,8],[22,10,23,10],[22,11,23,11],[22,12,23,12],[22,14,23,14],[24,22,25,22],[24,23,25,23],[24,7,25,7],[24,8,25,8],[24,10,25,10],[24,11,25,11],[22,15,23,15],[22,16,23,16],[22,18,23,18],[22,19,23,19],[22,20,23,20],[18,26,19,26],[20,26,21,26],[20,27,21,27],[22,0,23,0],[22,1,23,1],[22,2,23,2],[22,3,23,3],[22,4,23,4],[22,6,23,6],[20,18,21,18],[20,19,21,19],[20,20,21,20],[20,22,21,22],[20,23,21,23],[20,24,21,24],[20,10,21,10],[20,11,21,11],[20,12,21,12],[20,14,21,14],[20,15,21,15],[22,23,23,23],[22,24,23,24],[22,26,23,26],[22,27,23,27],[18,20,19,20],[18,22,19,22],[18,23,19,23],[18,24,19,24],[18,16,19,16],[18,18,19,18],[18,19,19,19],[18,4,19,4],[18,6,19,6],[18,7,19,7],[18,8,19,8],[18,10,19,10],[18,11,19,11],[16,23,17,23],[16,24,17,24],[16,26,17,26],[16,27,17,27],[18,0,19,0],[18,1,19,1],[18,2,19,2],[18,3,19,3],[16,15,17,15],[16,16,17,16],[16,18,17,18],[16,19,17,19],[16,20,17,20],[16,22,17,22],[16,7,17,7],[16,8,17,8],[16,10,17,10],[16,11,17,11],[16,12,17,12],[16,14,17,14],[18,27,19,27],[18,12,19,12],[18,14,19,14],[18,15,19,15],[16,0,17,0],[16,1,17,1],[16,2,17,2],[16,3,17,3],[16,4,17,4],[16,6,17,6],[14,18,15,18],[14,19,15,19],[14,20,15,20],[14,10,15,10],[14,11,15,11],[14,12,15,12],[14,14,15,14],[14,15,15,15],[14,16,15,16],[14,0,15,0],[14,1,15,1],[14,2,15,2],[14,3,15,3],[14,4,15,4],[14,6,15,6],[14,7,15,7],[14,8,15,8],[12,20,13,20],[12,22,13,22],[12,23,13,23],[12,24,13,24],[12,26,13,26],[14,26,15,26],[12,27,13,27],[12,12,13,12],[12,14,13,14],[12,15,13,15],[12,16,13,16],[12,18,13,18],[12,19,13,19],[14,27,15,27],[14,22,15,22],[14,23,15,23],[14,24,15,24],[12,0,13,0],[12,1,13,1],[12,2,13,2],[12,3,13,3],[10,14,11,14],[10,16,11,16],[10,18,11,18],[10,19,11,19],[12,4,13,4],[12,6,13,6],[12,7,13,7],[12,8,13,8],[10,6,11,6],[10,7,11,7],[10,8,11,8],[10,10,11,10],[10,11,11,11],[10,12,11,12],[10,0,11,0],[10,1,11,1],[10,2,11,2],[10,3,11,3],[10,4,11,4],[10,23,11,23],[10,24,11,24],[10,26,11,26],[8,22,9,22],[8,23,9,23],[8,24,9,24],[8,26,9,26],[8,27,9,27],[8,14,9,14],[8,15,9,15],[8,16,9,16],[8,18,9,18],[8,19,9,19],[8,20,9,20],[10,27,11,27],[10,22,11,22],[10,20,11,20],[6,19,6,22],[6,23,6,26],[0,12,0,13],[2,0,2,1],[2,5,2,7],[2,12,2,13],[8,0,9,0],[8,1,9,1],[8,2,9,2],[8,3,9,3],[8,4,9,4],[6,3,6,6],[6,7,6,10],[6,11,6,14],[6,15,6,18],[8,6,9,6],[8,7,9,7],[8,8,9,8],[8,10,9,10],[8,11,9,11],[8,12,9,12],[4,14,4,16]]}
["Wettkampfbogen",null,null,null,null,null,null,null,null,null,null,null,"Datum:",null,{"$f":"'INFO Blatt'!B13","v":"2019-02-16"}]
[]
[null,null,null,null,null,null,null,null,null,null,null,null,"Ort:",null,{"$f":"'INFO Blatt'!B11","v":"Hehlen"}]
[]
[null,null,null,null,null,null,null,null,null,null,null,null,null,"Liga:",{"$f":"'INFO Blatt'!B7","v":"Einsteigerliga"}]
[]
["Name","Verein","Jg","Boden",null,null,null,"Pferd",null,null,null,"Ringe",null,null,null,"Sprung",null,null,null,"Barren",null,null,null,"Reck",null,null,null,"Ges."]
[null,null,null,"D-Note","Abzug OK","E- Abzug","Note","D-Note","Abzug OK","E- Abzug","Note","D-Note","Abzug OK","E-Abzug","Note","D-Note","Abzug OK","E-Abzug","Note","D-Note","Abzug OK","E-Abzug","Note","D-Note","Abzug OK","E-Abzug","Note"]
[{"$f":"'Wertungszettel M4'!A7","v":"Sebastian Bocian"},{"$f":"Formeln!A8","v":"TSV Dielmissen"},{"$f":"IF(A9<>\"\", VLOOKUP(A9,'Wertungszettel M4'!A$7:B$36,2,0),\"\")","v":"2009"},6,null,2.5,{"$f":"IF(AND(F9>0,F10>0),IF(OR(F9>10,F9<0,F10>10,F10<0),\"Fehler\",IF(ABS(D9)-ABS(E9)-(F9+F10)/2+10>0,IF(D9<0,-(ABS(D9)-ABS(E9)-(F9+F10)/2+10),D9-ABS(E9)-(F9+F10)/2+10),0)),0)","v":13.65},5,null,4,{"$f":"IF(AND(J9>0,J10>0),IF(OR(J9>10,J9<0,J10>10,J10<0),\"Fehler\",IF(ABS(H9)-ABS(I9)-(J9+J10)/2+10>0,IF(H9<0,-(ABS(H9)-ABS(I9)-(J9+J10)/2+10),H9-ABS(I9)-(J9+J10)/2+10),0)),0)","v":11},6,null,2.2999999999999998,{"$f":"IF(AND(N9>0,N10>0),IF(OR(N9>10,N9<0,N10>10,N10<0),\"Fehler\",IF(ABS(L9)-ABS(M9)-(N9+N10)/2+10>0,IF(L9<0,-(ABS(L9)-ABS(M9)-(N9+N10)/2+10),L9-ABS(M9)-(N9+N10)/2+10),0)),0)","v":13.7},5,null,1.2,{"$f":"IF(AND(R9>0,R10>0),IF(OR(R9>10,R9<0,R10>10,R10<0),\"Fehler\",IF(ABS(P9)-ABS(Q9)-(R9+R10)/2+10>0,IF(P9<0,-(ABS(P9)-ABS(Q9)-(R9+R10)/2+10),P9-ABS(Q9)-(R9+R10)/2+10),0)),0)","v":13.9},5,null,1.4,{"$f":"IF(AND(V9>0,V10>0),IF(OR(V9>10,V9<0,V10>10,V10<0),\"Fehler\",IF(ABS(T9)-ABS(U9)-(V9+V10)/2+10>0,IF(T9<0,-(ABS(T9)-ABS(U9)-(V9+V10)/2+10),T9-ABS(U9)-(V9+V10)/2+10),0)),0)","v":13.6},5,null,1.5,{"$f":"IF(AND(Z9>0,Z10>0),IF(OR(Z9>10,Z9<0,Z10>10,Z10<0),\"Fehler\",IF(ABS(X9)-ABS(Y9)-(Z9+Z10)/2+10>0,IF(X9<0,-(ABS(X9)-ABS(Y9)-(Z9+Z10)/2+10),X9-ABS(Y9)-(Z9+Z10)/2+10),0)),0)","v":13.45},{"$f":"ABS(G9)+ABS(K9)+ABS(O9)+ABS(S9)+ABS(W9)+ABS(AA9)","v":79.3}]
[null,null,null,null,null,2.2000000000000002,null,null,null,4,null,null,null,2.2999999999999998,null,null,null,1,null,null,null,1.4,null,null,null,1.6]
[{"$f":"'Wertungszettel M4'!A9","v":"Yannick Schröder"},{"$f":"IF(A11>0,B9,\"\")","v":"TSV Dielmissen"},{"$f":"IF(A11<>\"\", VLOOKUP(A11,'Wertungszettel M4'!A$7:B$36,2,0),\"\")","v":"2009"},5,null,1,{"$f":"IF(AND(F11>0,F12>0),IF(OR(F11>10,F11<0,F12>10,F12<0),\"Fehler\",IF(ABS(D11)-ABS(E11)-(F11+F12)/2+10>0,IF(D11<0,-(ABS(D11)-ABS(E11)-(F11+F12)/2+10),D11-ABS(E11)-(F11+F12)/2+10),0)),0)","v":13.9},5,null,4.7,{"$f":"IF(AND(J11>0,J12>0),IF(OR(J11>10,J11<0,J12>10,J12<0),\"Fehler\",IF(ABS(H11)-ABS(I11)-(J11+J12)/2+10>0,IF(H11<0,-(ABS(H11)-ABS(I11)-(J11+J12)/2+10),H11-ABS(I11)-(J11+J12)/2+10),0)),0)","v":10.3},5,0.5,2.2000000000000002,{"$f":"IF(AND(N11>0,N12>0),IF(OR(N11>10,N11<0,N12>10,N12<0),\"Fehler\",IF(ABS(L11)-ABS(M11)-(N11+N12)/2+10>0,IF(L11<0,-(ABS(L11)-ABS(M11)-(N11+N12)/2+10),L11-ABS(M11)-(N11+N12)/2+10),0)),0)","v":12.3},5,null,1,{"$f":"IF(AND(R11>0,R12>0),IF(OR(R11>10,R11<0,R12>10,R12<0),\"Fehler\",IF(ABS(P11)-ABS(Q11)-(R11+R12)/2+10>0,IF(P11<0,-(ABS(P11)-ABS(Q11)-(R11+R12)/2+10),P11-ABS(Q11)-(R11+R12)/2+10),0)),0)","v":14},5,null,1.1000000000000001,{"$f":"IF(AND(V11>0,V12>0),IF(OR(V11>10,V11<0,V12>10,V12<0),\"Fehler\",IF(ABS(T11)-ABS(U11)-(V11+V12)/2+10>0,IF(T11<0,-(ABS(T11)-ABS(U11)-(V11+V12)/2+10),T11-ABS(U11)-(V11+V12)/2+10),0)),0)","v":13.8},5,null,1.4,{"$f":"IF(AND(Z11>0,Z12>0),IF(OR(Z11>10,Z11<0,Z12>10,Z12<0),\"Fehler\",IF(ABS(X11)-ABS(Y11)-(Z11+Z12)/2+10>0,IF(X11<0,-(ABS(X11)-ABS(Y11)-(Z11+Z12)/2+10),X11-ABS(Y11)-(Z11+Z12)/2+10),0)),0)","v":13.65},{"$f":"ABS(G11)+ABS(K11)+ABS(O11)+ABS(S11)+ABS(W11)+ABS(AA11)","v":77.95},null,null,null,"Boden",{"$f":"IF(G40>1,1,0)","v":1}]
[null,null,null,null,null,1.2,null,null,null,4.7,null,null,null,2.2000000000000002,null,null,null,1,null,null,null,1.3,null,null,null,1.3,null,null,null,null,null,"pauschenpferd",{"$f":"IF(K40>1,1,0)","v":1}]
[{"$f":"'Wertungszettel M4'!A11","v":"Tristan Warmuth"},{"$f":"IF(A13>0,B11,\"\")","v":"TSV Dielmissen"},{"$f":"IF(A13<>\"\", VLOOKUP(A13,'Wertungszettel M4'!A$7:B$36,2,0),\"\")","v":"2010"},5,null,2.7,{"$f":"IF(AND(F13>0,F14>0),IF(OR(F13>10,F13<0,F14>10,F14<0),\"Fehler\",IF(ABS(D13)-ABS(E13)-(F13+F14)/2+10>0,IF(D13<0,-(ABS(D13)-ABS(E13)-(F13+F14)/2+10),D13-ABS(E13)-(F13+F14)/2+10),0)),0)","v":12.55},5,null,5.3,{"$f":"IF(AND(J13>0,J14>0),IF(OR(J13>10,J13<0,J14>10,J14<0),\"Fehler\",IF(ABS(H13)-ABS(I13)-(J13+J14)/2+10>0,IF(H13<0,-(ABS(H13)-ABS(I13)-(J13+J14)/2+10),H13-ABS(I13)-(J13+J14)/2+10),0)),0)","v":9.6999999999999993},6,null,3.9,{"$f":"IF(AND(N13>0,N14>0),IF(OR(N13>10,N13<0,N14>10,N14<0),\"Fehler\",IF(ABS(L13)-ABS(M13)-(N13+N14)/2+10>0,IF(L13<0,-(ABS(L13)-ABS(M13)-(N13+N14)/2+10),L13-ABS(M13)-(N13+N14)/2+10),0)),0)","v":12.1},5,null,1.7,{"$f":"IF(AND(R13>0,R14>0),IF(OR(R13>10,R13<0,R14>10,R14<0),\"Fehler\",IF(ABS(P13)-ABS(Q13)-(R13+R14)/2+10>0,IF(P13<0,-(ABS(P13)-ABS(Q13)-(R13+R14)/2+10),P13-ABS(Q13)-(R13+R14)/2+10),0)),0)","v":13.3},5,null,2.2000000000000002,{"$f":"IF(AND(V13>0,V14>0),IF(OR(V13>10,V13<0,V14>10,V14<0),\"Fehler\",IF(ABS(T13)-ABS(U13)-(V13+V14)/2+10>0,IF(T13<0,-(ABS(T13)-ABS(U13)-(V13+V14)/2+10),T13-ABS(U13)-(V13+V14)/2+10),0)),0)","v":12.95},5,null,2.2999999999999998,{"$f":"IF(AND(Z13>0,Z14>0),IF(OR(Z13>10,Z13<0,Z14>10,Z14<0),\"Fehler\",IF(ABS(X13)-ABS(Y13)-(Z13+Z14)/2+10>0,IF(X13<0,-(ABS(X13)-ABS(Y13)-(Z13+Z14)/2+10),X13-ABS(Y13)-(Z13+Z14)/2+10),0)),0)","v":12.8},{"$f":"ABS(G13)+ABS(K13)+ABS(O13)+ABS(S13)+ABS(W13)+ABS(AA13)","v":73.400000000000006},null,null,null,"ringe",{"$f":"IF(O40>1,1,0)","v":1}]
[null,null,null,null,null,2.2000000000000002,null,null,null,5.3,null,null,null,3.9,null,null,null,1.7,null,null,null,1.9,null,null,null,2.1,null,null,null,null,null,"sprung",{"$f":"IF(S40>1,1,0)","v":1}]
[{"$f":"'Wertungszettel M4'!A13","v":"Leon Nolte-Furchner"},{"$f":"IF(A15>0,B13,\"\")","v":"TSV Dielmissen"},{"$f":"IF(A15<>\"\", VLOOKUP(A15,'Wertungszettel M4'!A$7:B$36,2,0),\"\")","v":"2011"},3,null,2.1,{"$f":"IF(AND(F15>0,F16>0),IF(OR(F15>10,F15<0,F16>10,F16<0),\"Fehler\",IF(ABS(D15)-ABS(E15)-(F15+F16)/2+10>0,IF(D15<0,-(ABS(D15)-ABS(E15)-(F15+F16)/2+10),D15-ABS(E15)-(F15+F16)/2+10),0)),0)","v":11.1},3,null,4.0999999999999996,{"$f":"IF(AND(J15>0,J16>0),IF(OR(J15>10,J15<0,J16>10,J16<0),\"Fehler\",IF(ABS(H15)-ABS(I15)-(J15+J16)/2+10>0,IF(H15<0,-(ABS(H15)-ABS(I15)-(J15+J16)/2+10),H15-ABS(I15)-(J15+J16)/2+10),0)),0)","v":8.9},3,null,1.9,{"$f":"IF(AND(N15>0,N16>0),IF(OR(N15>10,N15<0,N16>10,N16<0),\"Fehler\",IF(ABS(L15)-ABS(M15)-(N15+N16)/2+10>0,IF(L15<0,-(ABS(L15)-ABS(M15)-(N15+N16)/2+10),L15-ABS(M15)-(N15+N16)/2+10),0)),0)","v":11.1},5,null,1.2,{"$f":"IF(AND(R15>0,R16>0),IF(OR(R15>10,R15<0,R16>10,R16<0),\"Fehler\",IF(ABS(P15)-ABS(Q15)-(R15+R16)/2+10>0,IF(P15<0,-(ABS(P15)-ABS(Q15)-(R15+R16)/2+10),P15-ABS(Q15)-(R15+R16)/2+10),0)),0)","v":13.8},4,null,1.4,{"$f":"IF(AND(V15>0,V16>0),IF(OR(V15>10,V15<0,V16>10,V16<0),\"Fehler\",IF(ABS(T15)-ABS(U15)-(V15+V16)/2+10>0,IF(T15<0,-(ABS(T15)-ABS(U15)-(V15+V16)/2+10),T15-ABS(U15)-(V15+V16)/2+10),0)),0)","v":12.65},3,null,2.8,{"$f":"IF(AND(Z15>0,Z16>0),IF(OR(Z15>10,Z15<0,Z16>10,Z16<0),\"Fehler\",IF(ABS(X15)-ABS(Y15)-(Z15+Z16)/2+10>0,IF(X15<0,-(ABS(X15)-ABS(Y15)-(Z15+Z16)/2+10),X15-ABS(Y15)-(Z15+Z16)/2+10),0)),0)","v":10.4},{"$f":"ABS(G15)+ABS(K15)+ABS(O15)+ABS(S15)+ABS(W15)+ABS(AA15)","v":67.95},null,null,null,"Barren",{"$f":"IF(W40>1,1,0)","v":1}]
[null,null,null,null,null,1.7,null,null,null,4.0999999999999996,null,null,null,1.9,null,null,null,1.2,null,null,null,1.3,null,null,null,2.4,null,null,null,null,null,"Reck",{"$f":"IF(AA40>1,1,0)","v":1}]
[{"$f":"'Wertungszettel M4'!A15","v":"Joel Holzkamp"},{"$f":"IF(A17>0,B15,\"\")","v":"TSV Dielmissen"},{"$f":"IF(A17<>\"\", VLOOKUP(A17,'Wertungszettel M4'!A$7:B$36,2,0),\"\")","v":"2011"},3,null,1.2,{"$f":"IF(AND(F17>0,F18>0),IF(OR(F17>10,F17<0,F18>10,F18<0),\"Fehler\",IF(ABS(D17)-ABS(E17)-(F17+F18)/2+10>0,IF(D17<0,-(ABS(D17)-ABS(E17)-(F17+F18)/2+10),D17-ABS(E17)-(F17+F18)/2+10),0)),0)","v":11.7},3,null,4.5999999999999996,{"$f":"IF(AND(J17>0,J18>0),IF(OR(J17>10,J17<0,J18>10,J18<0),\"Fehler\",IF(ABS(H17)-ABS(I17)-(J17+J18)/2+10>0,IF(H17<0,-(ABS(H17)-ABS(I17)-(J17+J18)/2+10),H17-ABS(I17)-(J17+J18)/2+10),0)),0)","v":8.4},4,null,3.5,{"$f":"IF(AND(N17>0,N18>0),IF(OR(N17>10,N17<0,N18>10,N18<0),\"Fehler\",IF(ABS(L17)-ABS(M17)-(N17+N18)/2+10>0,IF(L17<0,-(ABS(L17)-ABS(M17)-(N17+N18)/2+10),L17-ABS(M17)-(N17+N18)/2+10),0)),0)","v":10.5},null,null,null,{"$f":"IF(AND(R17>0,R18>0),IF(OR(R17>10,R17<0,R18>10,R18<0),\"Fehler\",IF(ABS(P17)-ABS(Q17)-(R17+R18)/2+10>0,IF(P17<0,-(ABS(P17)-ABS(Q17)-(R17+R18)/2+10),P17-ABS(Q17)-(R17+R18)/2+10),0)),0)","v":0},3,null,1.6,{"$f":"IF(AND(V17>0,V18>0),IF(OR(V17>10,V17<0,V18>10,V18<0),\"Fehler\",IF(ABS(T17)-ABS(U17)-(V17+V18)/2+10>0,IF(T17<0,-(ABS(T17)-ABS(U17)-(V17+V18)/2+10),T17-ABS(U17)-(V17+V18)/2+10),0)),0)","v":11.2},3,null,3.2,{"$f":"IF(AND(Z17>0,Z18>0),IF(OR(Z17>10,Z17<0,Z18>10,Z18<0),\"Fehler\",IF(ABS(X17)-ABS(Y17)-(Z17+Z18)/2+10>0,IF(X17<0,-(ABS(X17)-ABS(Y17)-(Z17+Z18)/2+10),X17-ABS(Y17)-(Z17+Z18)/2+10),0)),0)","v":9.9},{"$f":"ABS(G17)+ABS(K17)+ABS(O17)+ABS(S17)+ABS(W17)+ABS(AA17)","v":51.699999999999996}]
[null,null,null,null,null,1.4,null,null,null,4.5999999999999996,null,null,null,3.5,null,null,null,null,null,null,null,2,null,null,null,3,null,null,null,null,null,"Gesamt",{"$f":"SUM(AG11:AG17)","v":6}]
[{"$f":"'Wertungszettel M4'!A18","v":0},{"$f":"IF(A19>0,B17,\"\")","v":""},{"$f":"IF(A19<>\"\", VLOOKUP(A19,'Wertungszettel M4'!A$7:B$36,2,0),\"\")","v":{"$error":"#N/A"}},null,null,null,{"$f":"IF(AND(F19>0,F20>0),IF(OR(F19>10,F19<0,F20>10,F20<0),\"Fehler\",IF(ABS(D19)-ABS(E19)-(F19+F20)/2+10>0,IF(D19<0,-(ABS(D19)-ABS(E19)-(F19+F20)/2+10),D19-ABS(E19)-(F19+F20)/2+10),0)),0)","v":0},null,null,null,{"$f":"IF(AND(J19>0,J20>0),IF(OR(J19>10,J19<0,J20>10,J20<0),\"Fehler\",IF(ABS(H19)-ABS(I19)-(J19+J20)/2+10>0,IF(H19<0,-(ABS(H19)-ABS(I19)-(J19+J20)/2+10),H19-ABS(I19)-(J19+J20)/2+10),0)),0)","v":0},null,null,null,{"$f":"IF(AND(N19>0,N20>0),IF(OR(N19>10,N19<0,N20>10,N20<0),\"Fehler\",IF(ABS(L19)-ABS(M19)-(N19+N20)/2+10>0,IF(L19<0,-(ABS(L19)-ABS(M19)-(N19+N20)/2+10),L19-ABS(M19)-(N19+N20)/2+10),0)),0)","v":0},null,null,null,{"$f":"IF(AND(R19>0,R20>0),IF(OR(R19>10,R19<0,R20>10,R20<0),\"Fehler\",IF(ABS(P19)-ABS(Q19)-(R19+R20)/2+10>0,IF(P19<0,-(ABS(P19)-ABS(Q19)-(R19+R20)/2+10),P19-ABS(Q19)-(R19+R20)/2+10),0)),0)","v":0},null,null,null,{"$f":"IF(AND(V19>0,V20>0),IF(OR(V19>10,V19<0,V20>10,V20<0),\"Fehler\",IF(ABS(T19)-ABS(U19)-(V19+V20)/2+10>0,IF(T19<0,-(ABS(T19)-ABS(U19)-(V19+V20)/2+10),T19-ABS(U19)-(V19+V20)/2+10),0)),0)","v":0},null,null,null,{"$f":"IF(AND(Z19>0,Z20>0),IF(OR(Z19>10,Z19<0,Z20>10,Z20<0),\"Fehler\",IF(ABS(X19)-ABS(Y19)-(Z19+Z20)/2+10>0,IF(X19<0,-(ABS(X19)-ABS(Y19)-(Z19+Z20)/2+10),X19-ABS(Y19)-(Z19+Z20)/2+10),0)),0)","v":0},{"$f":"ABS(G19)+ABS(K19)+ABS(O19)+ABS(S19)+ABS(W19)+ABS(AA19)","v":0}]
[]
[{"$f":"'Wertungszettel M4'!A19","v":"frei 7"},{"$f":"IF(A21>0,B19,\"\")","v":""},{"$f":"IF(A21<>\"\", VLOOKUP(A21,'Wertungszettel M4'!A$7:B$36,2,0),\"\")","v":0},null,null,null,{"$f":"IF(AND(F21>0,F22>0),IF(OR(F21>10,F21<0,F22>10,F22<0),\"Fehler\",IF(ABS(D21)-ABS(E21)-(F21+F22)/2+10>0,IF(D21<0,-(ABS(D21)-ABS(E21)-(F21+F22)/2+10),D21-ABS(E21)-(F21+F22)/2+10),0)),0)","v":0},null,null,null,{"$f":"IF(AND(J21>0,J22>0),IF(OR(J21>10,J21<0,J22>10,J22<0),\"Fehler\",IF(ABS(H21)-ABS(I21)-(J21+J22)/2+10>0,IF(H21<0,-(ABS(H21)-ABS(I21)-(J21+J22)/2+10),H21-ABS(I21)-(J21+J22)/2+10),0)),0)","v":0},null,null,null,{"$f":"IF(AND(N21>0,N22>0),IF(OR(N21>10,N21<0,N22>10,N22<0),\"Fehler\",IF(ABS(L21)-ABS(M21)-(N21+N22)/2+10>0,IF(L21<0,-(ABS(L21)-ABS(M21)-(N21+N22)/2+10),L21-ABS(M21)-(N21+N22)/2+10),0)),0)","v":0},null,null,null,{"$f":"IF(AND(R21>0,R22>0),IF(OR(R21>10,R21<0,R22>10,R22<0),\"Fehler\",IF(ABS(P21)-ABS(Q21)-(R21+R22)/2+10>0,IF(P21<0,-(ABS(P21)-ABS(Q21)-(R21+R22)/2+10),P21-ABS(Q21)-(R21+R22)/2+10),0)),0)","v":0},null,null,null,{"$f":"IF(AND(V21>0,V22>0),IF(OR(V21>10,V21<0,V22>10,V22<0),\"Fehler\",IF(ABS(T21)-ABS(U21)-(V21+V22)/2+10>0,IF(T21<0,-(ABS(T21)-ABS(U21)-(V21+V22)/2+10),T21-ABS(U21)-(V21+V22)/2+10),0)),0)","v":0},null,null,null,{"$f":"IF(AND(Z21>0,Z22>0),IF(OR(Z21>10,Z21<0,Z22>10,Z22<0),\"Fehler\",IF(ABS(X21)-ABS(Y21)-(Z21+Z22)/2+10>0,IF(X21<0,-(ABS(X21)-ABS(Y21)-(Z21+Z22)/2+10),X21-ABS(Y21)-(Z21+Z22)/2+10),0)),0)","v":0},{"$f":"ABS(G21)+ABS(K21)+ABS(O21)+ABS(S21)+ABS(W21)+ABS(AA21)","v":0}]
[]
[{"$f":"'Wertungszettel M4'!A21","v":"frei 8"},{"$f":"IF(A23>0,B21,\"\")","v":""},{"$f":"IF(A23<>\"\", VLOOKUP(A23,'Wertungszettel M4'!A$7:B$36,2,0),\"\")","v":0},null,null,null,{"$f":"IF(AND(F23>0,F24>0),IF(OR(F23>10,F23<0,F24>10,F24<0),\"Fehler\",IF(ABS(D23)-ABS(E23)-(F23+F24)/2+10>0,IF(D23<0,-(ABS(D23)-ABS(E23)-(F23+F24)/2+10),D23-ABS(E23)-(F23+F24)/2+10),0)),0)","v":0},null,null,null,{"$f":"IF(AND(J23>0,J24>0),IF(OR(J23>10,J23<0,J24>10,J24<0),\"Fehler\",IF(ABS(H23)-ABS(I23)-(J23+J24)/2+10>0,IF(H23<0,-(ABS(H23)-ABS(I23)-(J23+J24)/2+10),H23-ABS(I23)-(J23+J24)/2+10),0)),0)","v":0},null,null,null,{"$f":"IF(AND(N23>0,N24>0),IF(OR(N23>10,N23<0,N24>10,N24<0),\"Fehler\",IF(ABS(L23)-ABS(M23)-(N23+N24)/2+10>0,IF(L23<0,-(ABS(L23)-ABS(M23)-(N23+N24)/2+10),L23-ABS(M23)-(N23+N24)/2+10),0)),0)","v":0},null,null,null,{"$f":"IF(AND(R23>0,R24>0),IF(OR(R23>10,R23<0,R24>10,R24<0),\"Fehler\",IF(ABS(P23)-ABS(Q23)-(R23+R24)/2+10>0,IF(P23<0,-(ABS(P23)-ABS(Q23)-(R23+R24)/2+10),P23-ABS(Q23)-(R23+R24)/2+10),0)),0)","v":0},null,null,null,{"$f":"IF(AND(V23>0,V24>0),IF(OR(V23>10,V23<0,V24>10,V24<0),\"Fehler\",IF(ABS(T23)-ABS(U23)-(V23+V24)/2+10>0,IF(T23<0,-(ABS(T23)-ABS(U23)-(V23+V24)/2+10),T23-ABS(U23)-(V23+V24)/2+10),0)),0)","v":0},null,null,null,{"$f":"IF(AND(Z23>0,Z24>0),IF(OR(Z23>10,Z23<0,Z24>10,Z24<0),\"Fehler\",IF(ABS(X23)-ABS(Y23)-(Z23+Z24)/2+10>0,IF(X23<0,-(ABS(X23)-ABS(Y23)-(Z23+Z24)/2+10),X23-ABS(Y23)-(Z23+Z24)/2+10),0)),0)","v":0},{"$f":"ABS(G23)+ABS(K23)+ABS(O23)+ABS(S23)+ABS(W23)+ABS(AA23)","v":0}]
[]
[{"$f":"'Wertungszettel M4'!A23","v":"frei 9"},{"$f":"IF(A25>0,B23,\"\")","v":""},{"$f":"IF(A25<>\"\", VLOOKUP(A25,'Wertungszettel M4'!A$7:B$36,2,0),\"\")","v":0},null,null,null,{"$f":"IF(AND(F25>0,F26>0),IF(OR(F25>10,F25<0,F26>10,F26<0),\"Fehler\",IF(ABS(D25)-ABS(E25)-(F25+F26)/2+10>0,IF(D25<0,-(ABS(D25)-ABS(E25)-(F25+F26)/2+10),D25-ABS(E25)-(F25+F26)/2+10),0)),0)","v":0},null,null,null,{"$f":"IF(AND(J25>0,J26>0),IF(OR(J25>10,J25<0,J26>10,J26<0),\"Fehler\",IF(ABS(H25)-ABS(I25)-(J25+J26)/2+10>0,IF(H25<0,-(ABS(H25)-ABS(I25)-(J25+J26)/2+10),H25-ABS(I25)-(J25+J26)/2+10),0)),0)","v":0},null,null,null,{"$f":"IF(AND(N25>0,N26>0),IF(OR(N25>10,N25<0,N26>10,N26<0),\"Fehler\",IF(ABS(L25)-ABS(M25)-(N25+N26)/2+10>0,IF(L25<0,-(ABS(L25)-ABS(M25)-(N25+N26)/2+10),L25-ABS(M25)-(N25+N26)/2+10),0)),0)","v":0},null,null,null,{"$f":"IF(AND(R25>0,R26>0),IF(OR(R25>10,R25<0,R26>10,R26<0),\"Fehler\",IF(ABS(P25)-ABS(Q25)-(R25+R26)/2+10>0,IF(P25<0,-(ABS(P25)-ABS(Q25)-(R25+R26)/2+10),P25-ABS(Q25)-(R25+R26)/2+10),0)),0)","v":0},null,null,null,{"$f":"IF(AND(V25>0,V26>0),IF(OR(V25>10,V25<0,V26>10,V26<0),\"Fehler\",IF(ABS(T25)-ABS(U25)-(V25+V26)/2+10>0,IF(T25<0,-(ABS(T25)-ABS(U25)-(V25+V26)/2+10),T25-ABS(U25)-(V25+V26)/2+10),0)),0)","v":0},null,null,null,{"$f":"IF(AND(Z25>0,Z26>0),IF(OR(Z25>10,Z25<0,Z26>10,Z26<0),\"Fehler\",IF(ABS(X25)-ABS(Y25)-(Z25+Z26)/2+10>0,IF(X25<0,-(ABS(X25)-ABS(Y25)-(Z25+Z26)/2+10),X25-ABS(Y25)-(Z25+Z26)/2+10),0)),0)","v":0},{"$f":"ABS(G25)+ABS(K25)+ABS(O25)+ABS(S25)+ABS(W25)+ABS(AA25)","v":0}]
[]
[{"$f":"'Wertungszettel M4'!A25","v":"frei 10"},{"$f":"IF(A27>0,B25,\"\")","v":""},{"$f":"IF(A27<>\"\", VLOOKUP(A27,'Wertungszettel M4'!A$7:B$36,2,0),\"\")","v":0},null,null,null,{"$f":"IF(AND(F27>0,F28>0),IF(OR(F27>10,F27<0,F28>10,F28<0),\"Fehler\",IF(ABS(D27)-ABS(E27)-(F27+F28)/2+10>0,IF(D27<0,-(ABS(D27)-ABS(E27)-(F27+F28)/2+10),D27-ABS(E27)-(F27+F28)/2+10),0)),0)","v":0},null,null,null,{"$f":"IF(AND(J27>0,J28>0),IF(OR(J27>10,J27<0,J28>10,J28<0),\"Fehler\",IF(ABS(H27)-ABS(I27)-(J27+J28)/2+10>0,IF(H27<0,-(ABS(H27)-ABS(I27)-(J27+J28)/2+10),H27-ABS(I27)-(J27+J28)/2+10),0)),0)","v":0},null,null,null,{"$f":"IF(AND(N27>0,N28>0),IF(OR(N27>10,N27<0,N28>10,N28<0),\"Fehler\",IF(ABS(L27)-ABS(M27)-(N27+N28)/2+10>0,IF(L27<0,-(ABS(L27)-ABS(M27)-(N27+N28)/2+10),L27-ABS(M27)-(N27+N28)/2+10),0)),0)","v":0},null,null,null,{"$f":"IF(AND(R27>0,R28>0),IF(OR(R27>10,R27<0,R28>10,R28<0),\"Fehler\",IF(ABS(P27)-ABS(Q27)-(R27+R28)/2+10>0,IF(P27<0,-(ABS(P27)-ABS(Q27)-(R27+R28)/2+10),P27-ABS(Q27)-(R27+R28)/2+10),0)),0)","v":0},null,null,null,{"$f":"IF(AND(V27>0,V28>0),IF(OR(V27>10,V27<0,V28>10,V28<0),\"Fehler\",IF(ABS(T27)-ABS(U27)-(V27+V28)/2+10>0,IF(T27<0,-(ABS(T27)-ABS(U27)-(V27+V28)/2+10),T27-ABS(U27)-(V27+V28)/2+10),0)),0)","v":0},null,null,null,{"$f":"IF(AND(Z27>0,Z28>0),IF(OR(Z27>10,Z27<0,Z28>10,Z28<0),\"Fehler\",IF(ABS(X27)-ABS(Y27)-(Z27+Z28)/2+10>0,IF(X27<0,-(ABS(X27)-ABS(Y27)-(Z27+Z28)/2+10),X27-ABS(Y27)-(Z27+Z28)/2+10),0)),0)","v":0},{"$f":"ABS(G27)+ABS(K27)+ABS(O27)+ABS(S27)+ABS(W27)+ABS(AA27)","v":0}]
[]
[{"$f":"'Wertungszettel M4'!A27","v":"frei 11"},{"$f":"IF(A29>0,B27,\"\")","v":""},{"$f":"IF(A29<>\"\", VLOOKUP(A29,'Wertungszettel M4'!A$7:B$36,2,0),\"\")","v":0},null,null,null,{"$f":"IF(AND(F29>0,F30>0),IF(OR(F29>10,F29<0,F30>10,F30<0),\"Fehler\",IF(ABS(D30)-ABS(E30)-(F29+F30)/2+10>0,IF(D30<0,-(ABS(D30)-ABS(E30)-(F29+F30)/2+10),D29-ABS(E29)-(F29+F30)/2+10),0)),0)","v":0},null,null,null,{"$f":"IF(AND(J29>0,J30>0),IF(OR(J29>10,J29<0,J30>10,J30<0),\"Fehler\",IF(ABS(H30)-ABS(I30)-(J29+J30)/2+10>0,IF(H30<0,-(ABS(H30)-ABS(I30)-(J29+J30)/2+10),H29-ABS(I29)-(J29+J30)/2+10),0)),0)","v":0},null,null,null,{"$f":"IF(AND(N29>0,N30>0),IF(OR(N29>10,N29<0,N30>10,N30<0),\"Fehler\",IF(ABS(L30)-ABS(M30)-(N29+N30)/2+10>0,IF(L30<0,-(ABS(L30)-ABS(M30)-(N29+N30)/2+10),L29-ABS(M29)-(N29+N30)/2+10),0)),0)","v":0},null,null,null,{"$f":"IF(AND(R29>0,R30>0),IF(OR(R29>10,R29<0,R30>10,R30<0),\"Fehler\",IF(ABS(P30)-ABS(Q30)-(R29+R30)/2+10>0,IF(P30<0,-(ABS(P30)-ABS(Q30)-(R29+R30)/2+10),P29-ABS(Q29)-(R29+R30)/2+10),0)),0)","v":0},null,null,null,{"$f":"IF(AND(V29>0,V30>0),IF(OR(V29>10,V29<0,V30>10,V30<0),\"Fehler\",IF(ABS(T30)-ABS(U30)-(V29+V30)/2+10>0,IF(T30<0,-(ABS(T30)-ABS(U30)-(V29+V30)/2+10),T29-ABS(U29)-(V29+V30)/2+10),0)),0)","v":0},null,null,null,{"$f":"IF(AND(Z29>0,Z30>0),IF(OR(Z29>10,Z29<0,Z30>10,Z30<0),\"Fehler\",IF(ABS(X30)-ABS(Y30)-(Z29+Z30)/2+10>0,IF(X30<0,-(ABS(X30)-ABS(Y30)-(Z29+Z30)/2+10),X29-ABS(Y29)-(Z29+Z30)/2+10),0)),0)","v":0},{"$f":"ABS(G29)+ABS(K29)+ABS(O29)+ABS(S29)+ABS(W29)+ABS(AA29)","v":0}]
[]
[{"$f":"'Wertungszettel M4'!A29","v":"frei 12"},{"$f":"IF(A31>0,B29,\"\")","v":""},{"$f":"IF(A31<>\"\", VLOOKUP(A31,'Wertungszettel M4'!A$7:B$36,2,0),\"\")","v":0},null,null,null,{"$f":"IF(AND(F31>0,F32>0),IF(OR(F31>10,F31<0,F32>10,F32<0),\"Fehler\",IF(ABS(D32)-ABS(E32)-(F31+F32)/2+10>0,IF(D32<0,-(ABS(D32)-ABS(E32)-(F31+F32)/2+10),D31-ABS(E31)-(F31+F32)/2+10),0)),0)","v":0},null,null,null,{"$f":"IF(AND(J31>0,J32>0),IF(OR(J31>10,J31<0,J32>10,J32<0),\"Fehler\",IF(ABS(H32)-ABS(I32)-(J31+J32)/2+10>0,IF(H32<0,-(ABS(H32)-ABS(I32)-(J31+J32)/2+10),H31-ABS(I31)-(J31+J32)/2+10),0)),0)","v":0},null,null,null,{"$f":"IF(AND(N31>0,N32>0),IF(OR(N31>10,N31<0,N32>10,N32<0),\"Fehler\",IF(ABS(L32)-ABS(M32)-(N31+N32)/2+10>0,IF(L32<0,-(ABS(L32)-ABS(M32)-(N31+N32)/2+10),L31-ABS(M31)-(N31+N32)/2+10),0)),0)","v":0},null,null,null,{"$f":"IF(AND(R31>0,R32>0),IF(OR(R31>10,R31<0,R32>10,R32<0),\"Fehler\",IF(ABS(P32)-ABS(Q32)-(R31+R32)/2+10>0,IF(P32<0,-(ABS(P32)-ABS(Q32)-(R31+R32)/2+10),P31-ABS(Q31)-(R31+R32)/2+10),0)),0)","v":0},null,null,null,{"$f":"IF(AND(V31>0,V32>0),IF(OR(V31>10,V31<0,V32>10,V32<0),\"Fehler\",IF(ABS(T32)-ABS(U32)-(V31+V32)/2+10>0,IF(T32<0,-(ABS(T32)-ABS(U32)-(V31+V32)/2+10),T31-ABS(U31)-(V31+V32)/2+10),0)),0)","v":0},null,null,null,{"$f":"IF(AND(Z31>0,Z32>0),IF(OR(Z31>10,Z31<0,Z32>10,Z32<0),\"Fehler\",IF(ABS(X32)-ABS(Y32)-(Z31+Z32)/2+10>0,IF(X32<0,-(ABS(X32)-ABS(Y32)-(Z31+Z32)/2+10),X31-ABS(Y31)-(Z31+Z32)/2+10),0)),0)","v":0},{"$f":"ABS(G31)+ABS(K31)+ABS(O31)+ABS(S31)+ABS(W31)+ABS(AA31)","v":0}]
[]
[{"$f":"'Wertungszettel M4'!A31","v":"frei 13"},{"$f":"IF(A33>0,B31,\"\")","v":""},{"$f":"IF(A33<>\"\", VLOOKUP(A33,'Wertungszettel M4'!A$7:B$36,2,0),\"\")","v":0},null,null,null,{"$f":"IF(AND(F33>0,F34>0),IF(OR(F33>10,F33<0,F34>10,F34<0),\"Fehler\",IF(ABS(D34)-ABS(E34)-(F33+F34)/2+10>0,IF(D34<0,-(ABS(D34)-ABS(E34)-(F33+F34)/2+10),D33-ABS(E33)-(F33+F34)/2+10),0)),0)","v":0},null,null,null,{"$f":"IF(AND(J33>0,J34>0),IF(OR(J33>10,J33<0,J34>10,J34<0),\"Fehler\",IF(ABS(H34)-ABS(I34)-(J33+J34)/2+10>0,IF(H34<0,-(ABS(H34)-ABS(I34)-(J33+J34)/2+10),H33-ABS(I33)-(J33+J34)/2+10),0)),0)","v":0},null,null,null,{"$f":"IF(AND(N33>0,N34>0),IF(OR(N33>10,N33<0,N34>10,N34<0),\"Fehler\",IF(ABS(L34)-ABS(M34)-(N33+N34)/2+10>0,IF(L34<0,-(ABS(L34)-ABS(M34)-(N33+N34)/2+10),L33-ABS(M33)-(N33+N34)/2+10),0)),0)","v":0},null,null,null,{"$f":"IF(AND(R33>0,R34>0),IF(OR(R33>10,R33<0,R34>10,R34<0),\"Fehler\",IF(ABS(P34)-ABS(Q34)-(R33+R34)/2+10>0,IF(P34<0,-(ABS(P34)-ABS(Q34)-(R33+R34)/2+10),P33-ABS(Q33)-(R33+R34)/2+10),0)),0)","v":0},null,null,null,{"$f":"IF(AND(V33>0,V34>0),IF(OR(V33>10,V33<0,V34>10,V34<0),\"Fehler\",IF(ABS(T34)-ABS(U34)-(V33+V34)/2+10>0,IF(T34<0,-(ABS(T34)-ABS(U34)-(V33+V34)/2+10),T33-ABS(U33)-(V33+V34)/2+10),0)),0)","v":0},null,null,null,{"$f":"IF(AND(Z33>0,Z34>0),IF(OR(Z33>10,Z33<0,Z34>10,Z34<0),\"Fehler\",IF(ABS(X34)-ABS(Y34)-(Z33+Z34)/2+10>0,IF(X34<0,-(ABS(X34)-ABS(Y34)-(Z33+Z34)/2+10),X33-ABS(Y33)-(Z33+Z34)/2+10),0)),0)","v":0},{"$f":"ABS(G33)+ABS(K33)+ABS(O33)+ABS(S33)+ABS(W33)+ABS(AA33)","v":0}]
[]
[{"$f":"'Wertungszettel M4'!A33","v":"frei 14"},{"$f":"IF(A35>0,B33,\"\")","v":""},{"$f":"IF(A35<>\"\", VLOOKUP(A35,'Wertungszettel M4'!A$7:B$36,2,0),\"\")","v":0},null,null,null,{"$f":"IF(AND(F35>0,F36>0),IF(OR(F35>10,F35<0,F36>10,F36<0),\"Fehler\",IF(ABS(D36)-ABS(E36)-(F35+F36)/2+10>0,IF(D36<0,-(ABS(D36)-ABS(E36)-(F35+F36)/2+10),D35-ABS(E35)-(F35+F36)/2+10),0)),0)","v":0},null,null,null,{"$f":"IF(AND(J35>0,J36>0),IF(OR(J35>10,J35<0,J36>10,J36<0),\"Fehler\",IF(ABS(H36)-ABS(I36)-(J35+J36)/2+10>0,IF(H36<0,-(ABS(H36)-ABS(I36)-(J35+J36)/2+10),H35-ABS(I35)-(J35+J36)/2+10),0)),0)","v":0},null,null,null,{"$f":"IF(AND(N35>0,N36>0),IF(OR(N35>10,N35<0,N36>10,N36<0),\"Fehler\",IF(ABS(L36)-ABS(M36)-(N35+N36)/2+10>0,IF(L36<0,-(ABS(L36)-ABS(M36)-(N35+N36)/2+10),L35-ABS(M35)-(N35+N36)/2+10),0)),0)","v":0},null,null,null,{"$f":"IF(AND(R35>0,R36>0),IF(OR(R35>10,R35<0,R36>10,R36<0),\"Fehler\",IF(ABS(P36)-ABS(Q36)-(R35+R36)/2+10>0,IF(P36<0,-(ABS(P36)-ABS(Q36)-(R35+R36)/2+10),P35-ABS(Q35)-(R35+R36)/2+10),0)),0)","v":0},null,null,null,{"$f":"IF(AND(V35>0,V36>0),IF(OR(V35>10,V35<0,V36>10,V36<0),\"Fehler\",IF(ABS(T36)-ABS(U36)-(V35+V36)/2+10>0,IF(T36<0,-(ABS(T36)-ABS(U36)-(V35+V36)/2+10),T35-ABS(U35)-(V35+V36)/2+10),0)),0)","v":0},null,null,null,{"$f":"IF(AND(Z35>0,Z36>0),IF(OR(Z35>10,Z35<0,Z36>10,Z36<0),\"Fehler\",IF(ABS(X36)-ABS(Y36)-(Z35+Z36)/2+10>0,IF(X36<0,-(ABS(X36)-ABS(Y36)-(Z35+Z36)/2+10),X35-ABS(Y35)-(Z35+Z36)/2+10),0)),0)","v":0},{"$f":"ABS(G35)+ABS(K35)+ABS(O35)+ABS(S35)+ABS(W35)+ABS(AA35)","v":0}]
[]
[{"$f":"'Wertungszettel M4'!A35","v":"frei 15"},{"$f":"IF(A37>0,B35,\"\")","v":""},{"$f":"IF(A37<>\"\", VLOOKUP(A37,'Wertungszettel M4'!A$7:B$36,2,0),\"\")","v":0},null,null,null,{"$f":"IF(AND(F37>0,F38>0),IF(OR(F37>10,F37<0,F38>10,F38<0),\"Fehler\",IF(ABS(D38)-ABS(E38)-(F37+F38)/2+10>0,IF(D38<0,-(ABS(D38)-ABS(E38)-(F37+F38)/2+10),D37-ABS(E37)-(F37+F38)/2+10),0)),0)","v":0},null,null,null,{"$f":"IF(AND(J37>0,J38>0),IF(OR(J37>10,J37<0,J38>10,J38<0),\"Fehler\",IF(ABS(H38)-ABS(I38)-(J37+J38)/2+10>0,IF(H38<0,-(ABS(H38)-ABS(I38)-(J37+J38)/2+10),H37-ABS(I37)-(J37+J38)/2+10),0)),0)","v":0},null,null,null,{"$f":"IF(AND(N37>0,N38>0),IF(OR(N37>10,N37<0,N38>10,N38<0),\"Fehler\",IF(ABS(L38)-ABS(M38)-(N37+N38)/2+10>0,IF(L38<0,-(ABS(L38)-ABS(M38)-(N37+N38)/2+10),L37-ABS(M37)-(N37+N38)/2+10),0)),0)","v":0},null,null,null,{"$f":"IF(AND(R37>0,R38>0),IF(OR(R37>10,R37<0,R38>10,R38<0),\"Fehler\",IF(ABS(P38)-ABS(Q38)-(R37+R38)/2+10>0,IF(P38<0,-(ABS(P38)-ABS(Q38)-(R37+R38)/2+10),P37-ABS(Q37)-(R37+R38)/2+10),0)),0)","v":0},null,null,null,{"$f":"IF(AND(V37>0,V38>0),IF(OR(V37>10,V37<0,V38>10,V38<0),\"Fehler\",IF(ABS(T38)-ABS(U38)-(V37+V38)/2+10>0,IF(T38<0,-(ABS(T38)-ABS(U38)-(V37+V38)/2+10),T37-ABS(U37)-(V37+V38)/2+10),0)),0)","v":0},null,null,null,{"$f":"IF(AND(Z37>0,Z38>0),IF(OR(Z37>10,Z37<0,Z38>10,Z38<0),\"Fehler\",IF(ABS(X38)-ABS(Y38)-(Z37+Z38)/2+10>0,IF(X38<0,-(ABS(X38)-ABS(Y38)-(Z37+Z38)/2+10),X37-ABS(Y37)-(Z37+Z38)/2+10),0)),0)","v":0},{"$f":"ABS(G37)+ABS(K37)+ABS(O37)+ABS(S37)+ABS(W37)+ABS(AA37)","v":0}]
[]
[]
[null,null,null,null,null,null,{"$f":"SUM(LARGE(G9:G38,1),LARGE(G9:G38,2),LARGE(G9:G38,3))","v":40.1},null,null,null,{"$f":"SUM(LARGE(K9:K38,1),LARGE(K9:K38,2),LARGE(K9:K38,3))","v":31},null,null,null,{"$f":"SUM(LARGE(O9:O38,1),LARGE(O9:O38,2),LARGE(O9:O38,3))","v":38.1},null,null,null,{"$f":"SUM(LARGE(S9:S38,1),LARGE(S9:S38,2),LARGE(S9:S38,3))","v":41.7},null,null,null,{"$f":"SUM(LARGE(W9:W38,1),LARGE(W9:W38,2),LARGE(W9:W38,3))","v":40.349999999999994},null,null,null,{"$f":"SUM(LARGE(AA9:AA38,1),LARGE(AA9:AA38,2),LARGE(AA9:AA38,3))","v":39.900000000000006},{"$f":"SUM(G40,K40,O40,S40,W40,AA40)","v":231.14999999999998}]

{"sheet":"M5","index":8,"n_rows":40,"n_cols":33,"rows_kept":40,"cut":false,"hidden":false,"merged":[[36,26,37,26],[36,27,37,27],[34,23,35,23],[34,24,35,24],[34,26,35,26],[34,27,35,27],[36,0,37,0],[36,1,37,1],[36,2,37,2],[36,3,37,3],[36,4,37,4],[36,6,37,6],[36,7,37,7],[36,8,37,8],[36,10,37,10],[36,11,37,11],[36,12,37,12],[36,14,37,14],[36,15,37,15],[36,16,37,16],[36,18,37,18],[36,19,37,19],[36,20,37,20],[36,22,37,22],[36,23,37,23],[36,24,37,24],[34,11,35,11],[34,12,35,12],[34,14,35,14],[34,15,35,15],[34,16,35,16],[34,18,35,18],[34,19,35,19],[34,20,35,20],[34,22,35,22],[34,0,35,0],[34,1,35,1],[34,2,35,2],[34,3,35,3],[34,4,35,4],[34,6,35,6],[34,7,35,7],[34,8,35,8],[34,10,35,10],[30,26,31,26],[30,27,31,27],[32,0,33,0],[32,1,33,1],[32,2,33,2],[32,3,33,3],[32,4,33,4],[32,6,33,6],[32,7,33,7],[32,8,33,8],[32,10,33,10],[32,11,33,11],[32,12,33,12],[32,14,33,14],[32,15,33,15],[32,16,33,16],[32,18,33,18],[32,19,33,19],[32,20,33,20],[32,22,33,22],[32,23,33,23],[32,24,33,24],[32,26,33,26],[32,27,33,27],[28,23,29,23],[28,24,29,24],[28,26,29,26],[28,27,29,27],[30,0,31,0],[30,1,31,1],[30,2,31,2],[30,3,31,3],[30,4,31,4],[30,6,31,6],[30,7,31,7],[30,8,31,8],[30,10,31,10],[30,11,31,11],[30,12,31,12],[30,14,31,14],[30,15,31,15],[30,16,31,16],[30,18,31,18],[30,19,31,19],[30,20,31,20],[30,22,31,22],[30,23,31,23],[30,24,31,24],[28,11,29,11],[28,12,29,12],[28,14,29,14],[28,15,29,15],[28,16,29,16],[28,18,29,18],[28,19,29,19],[28,20,29,20],[28,22,29,22],[28,0,29,0],[28,1,29,1],[28,2,29,2],[28,3,29,3],[28,4,29,4],[28,6,29,6],[28,7,29,7],[28,8,29,8],[28,10,29,10],[26,0,27,0],[26,1,27,1],[26,2,27,2],[26,3,27,3],[26,4,27,4],[26,6,27,6],[26,7,27,7],[26,8,27,8],[20,0,21,0],[20,1,21,1],[20,2,21,2],[20,3,21,3],[24,0,25,0],[24,1,25,1],[24,2,25,2],[24,3,25,3],[24,4,25,4],[24,6,25,6],[20,4,21,4],[20,6,21,6],[20,7,21,7],[20,8,21,8],[26,10,27,10],[26,11,27,11],[26,12,27,12],[26,14,27,14],[26,15,27,15],[26,16,27,16],[2,14,2,16],[0,14,0,16],[10,15,11,15],[12,10,13,10],[20,16,21,16],[12,11,13,11],[24,24,25,24],[24,26,25,26],[26,26,27,26],[24,27,25,27],[24,12,25,12],[24,14,25,14],[24,15,25,15],[24,16,25,16],[24,18,25,18],[24,19,25,19],[26,27,27,27],[26,22,27,22],[26,23,27,23],[26,24,27,24],[24,20,25,20],[26,18,27,18],[26,19,27,19],[26,20,27,20],[22,22,23,22],[22,7,23,7],[22,8,23,8],[22,10,23,10],[22,11,23,11],[22,12,23,12],[22,14,23,14],[24,22,25,22],[24,23,25,23],[24,7,25,7],[24,8,25,8],[24,10,25,10],[24,11,25,11],[22,15,23,15],[22,16,23,16],[22,18,23,18],[22,19,23,19],[22,20,23,20],[18,26,19,26],[20,26,21,26],[20,27,21,27],[22,0,23,0],[22,1,23,1],[22,2,23,2],[22,3,23,3],[22,4,23,4],[22,6,23,6],[20,18,21,18],[20,19,21,19],[20,20,21,20],[20,22,21,22],[20,23,21,23],[20,24,21,24],[20,10,21,10],[20,11,21,11],[20,12,21,12],[20,14,21,14],[20,15,21,15],[22,23,23,23],[22,24,23,24],[22,26,23,26],[22,27,23,27],[18,20,19,20],[18,22,19,22],[18,23,19,23],[18,24,19,24],[18,16,19,16],[18,18,19,18],[18,19,19,19],[18,4,19,4],[18,6,19,6],[18,7,19,7],[18,8,19,8],[18,10,19,10],[18,11,19,11],[16,23,17,23],[16,24,17,24],[16,26,17,26],[16,27,17,27],[18,0,19,0],[18,1,19,1],[18,2,19,2],[18,3,19,3],[16,15,17,15],[16,16,17,16],[16,18,17,18],[16,19,17,19],[16,20,17,20],[16,22,17,22],[16,7,17,7],[16,8,17,8],[16,10,17,10],[16,11,17,11],[16,12,17,12],[16,14,17,14],[18,27,19,27],[18,12,19,12],[18,14,19,14],[18,15,19,15],[16,0,17,0],[16,1,17,1],[16,2,17,2],[16,3,17,3],[16,4,17,4],[16,6,17,6],[14,18,15,18],[14,19,15,19],[14,20,15,20],[14,10,15,10],[14,11,15,11],[14,12,15,12],[14,14,15,14],[14,15,15,15],[14,16,15,16],[14,0,15,0],[14,1,15,1],[14,2,15,2],[14,3,15,3],[14,4,15,4],[14,6,15,6],[14,7,15,7],[14,8,15,8],[12,20,13,20],[12,22,13,22],[12,23,13,23],[12,24,13,24],[12,26,13,26],[14,26,15,26],[12,27,13,27],[12,12,13,12],[12,14,13,14],[12,15,13,15],[12,16,13,16],[12,18,13,18],[12,19,13,19],[14,27,15,27],[14,22,15,22],[14,23,15,23],[14,24,15,24],[12,0,13,0],[12,1,13,1],[12,2,13,2],[12,3,13,3],[10,14,11,14],[10,16,11,16],[10,18,11,18],[10,19,11,19],[12,4,13,4],[12,6,13,6],[12,7,13,7],[12,8,13,8],[10,6,11,6],[10,7,11,7],[10,8,11,8],[10,10,11,10],[10,11,11,11],[10,12,11,12],[10,0,11,0],[10,1,11,1],[10,2,11,2],[10,3,11,3],[10,4,11,4],[10,23,11,23],[10,24,11,24],[10,26,11,26],[8,22,9,22],[8,23,9,23],[8,24,9,24],[8,26,9,26],[8,27,9,27],[8,14,9,14],[8,15,9,15],[8,16,9,16],[8,18,9,18],[8,19,9,19],[8,20,9,20],[10,27,11,27],[10,22,11,22],[10,20,11,20],[6,19,6,22],[6,23,6,26],[0,12,0,13],[2,0,2,1],[2,5,2,7],[2,12,2,13],[8,0,9,0],[8,1,9,1],[8,2,9,2],[8,3,9,3],[8,4,9,4],[6,3,6,6],[6,7,6,10],[6,11,6,14],[6,15,6,18],[8,6,9,6],[8,7,9,7],[8,8,9,8],[8,10,9,10],[8,11,9,11],[8,12,9,12],[4,14,4,16]]}
["Wettkampfbogen",null,null,null,null,null,null,null,null,null,null,null,"Datum:",null,{"$f":"'INFO Blatt'!B13","v":"2019-02-16"}]
[]
[null,null,null,null,null,null,null,null,null,null,null,null,"Ort:",null,{"$f":"'INFO Blatt'!B11","v":"Hehlen"}]
[]
[null,null,null,null,null,null,null,null,null,null,null,null,null,"Liga:",{"$f":"'INFO Blatt'!B7","v":"Einsteigerliga"}]
[]
["Name","Verein","Jg","Boden",null,null,null,"Pferd",null,null,null,"Ringe",null,null,null,"Sprung",null,null,null,"Barren",null,null,null,"Reck",null,null,null,"Ges."]
[null,null,null,"D-Note","Abzug OK","E- Abzug","Note","D-Note","Abzug OK","E- Abzug","Note","D-Note","Abzug OK","E-Abzug","Note","D-Note","Abzug OK","E-Abzug","Note","D-Note","Abzug OK","E-Abzug","Note","D-Note","Abzug OK","E-Abzug","Note"]
[{"$f":"'Wertungszettel M5'!A7","v":"frei 1"},{"$f":"Formeln!A9","v":"M5"},{"$f":"IF(A9<>\"\", VLOOKUP(A9,'Wertungszettel M5'!A$7:B$36,2,0),\"\")","v":0},null,null,null,{"$f":"IF(AND(F9>0,F10>0),IF(OR(F9>10,F9<0,F10>10,F10<0),\"Fehler\",IF(ABS(D9)-ABS(E9)-(F9+F10)/2+10>0,IF(D9<0,-(ABS(D9)-ABS(E9)-(F9+F10)/2+10),D9-ABS(E9)-(F9+F10)/2+10),0)),0)","v":0},null,null,null,{"$f":"IF(AND(J9>0,J10>0),IF(OR(J9>10,J9<0,J10>10,J10<0),\"Fehler\",IF(ABS(H9)-ABS(I9)-(J9+J10)/2+10>0,IF(H9<0,-(ABS(H9)-ABS(I9)-(J9+J10)/2+10),H9-ABS(I9)-(J9+J10)/2+10),0)),0)","v":0},null,null,null,{"$f":"IF(AND(N9>0,N10>0),IF(OR(N9>10,N9<0,N10>10,N10<0),\"Fehler\",IF(ABS(L9)-ABS(M9)-(N9+N10)/2+10>0,IF(L9<0,-(ABS(L9)-ABS(M9)-(N9+N10)/2+10),L9-ABS(M9)-(N9+N10)/2+10),0)),0)","v":0},null,null,null,{"$f":"IF(AND(R9>0,R10>0),IF(OR(R9>10,R9<0,R10>10,R10<0),\"Fehler\",IF(ABS(P9)-ABS(Q9)-(R9+R10)/2+10>0,IF(P9<0,-(ABS(P9)-ABS(Q9)-(R9+R10)/2+10),P9-ABS(Q9)-(R9+R10)/2+10),0)),0)","v":0},null,null,null,{"$f":"IF(AND(V9>0,V10>0),IF(OR(V9>10,V9<0,V10>10,V10<0),\"Fehler\",IF(ABS(T9)-ABS(U9)-(V9+V10)/2+10>0,IF(T9<0,-(ABS(T9)-ABS(U9)-(V9+V10)/2+10),T9-ABS(U9)-(V9+V10)/2+10),0)),0)","v":0},null,null,null,{"$f":"IF(AND(Z9>0,Z10>0),IF(OR(Z9>10,Z9<0,Z10>10,Z10<0),\"Fehler\",IF(ABS(X9)-ABS(Y9)-(Z9+Z10)/2+10>0,IF(X9<0,-(ABS(X9)-ABS(Y9)-(Z9+Z10)/2+10),X9-ABS(Y9)-(Z9+Z10)/2+10),0)),0)","v":0},{"$f":"ABS(G9)+ABS(K9)+ABS(O9)+ABS(S9)+ABS(W9)+ABS(AA9)","v":0}]
[]
[{"$f":"'Wertungszettel M5'!A9","v":"frei 2"},{"$f":"IF(A11>0,B9,\"\")","v":"M5"},{"$f":"IF(A11<>\"\", VLOOKUP(A11,'Wertungszettel M5'!A$7:B$36,2,0),\"\")","v":0},null,null,null,{"$f":"IF(AND(F11>0,F12>0),IF(OR(F11>10,F11<0,F12>10,F12<0),\"Fehler\",IF(ABS(D11)-ABS(E11)-(F11+F12)/2+10>0,IF(D11<0,-(ABS(D11)-ABS(E11)-(F11+F12)/2+10),D11-ABS(E11)-(F11+F12)/2+10),0)),0)","v":0},null,null,null,{"$f":"IF(AND(J11>0,J12>0),IF(OR(J11>10,J11<0,J12>10,J12<0),\"Fehler\",IF(ABS(H11)-ABS(I11)-(J11+J12)/2+10>0,IF(H11<0,-(ABS(H11)-ABS(I11)-(J11+J12)/2+10),H11-ABS(I11)-(J11+J12)/2+10),0)),0)","v":0},null,null,null,{"$f":"IF(AND(N11>0,N12>0),IF(OR(N11>10,N11<0,N12>10,N12<0),\"Fehler\",IF(ABS(L11)-ABS(M11)-(N11+N12)/2+10>0,IF(L11<0,-(ABS(L11)-ABS(M11)-(N11+N12)/2+10),L11-ABS(M11)-(N11+N12)/2+10),0)),0)","v":0},null,null,null,{"$f":"IF(AND(R11>0,R12>0),IF(OR(R11>10,R11<0,R12>10,R12<0),\"Fehler\",IF(ABS(P11)-ABS(Q11)-(R11+R12)/2+10>0,IF(P11<0,-(ABS(P11)-ABS(Q11)-(R11+R12)/2+10),P11-ABS(Q11)-(R11+R12)/2+10),0)),0)","v":0},null,null,null,{"$f":"IF(AND(V11>0,V12>0),IF(OR(V11>10,V11<0,V12>10,V12<0),\"Fehler\",IF(ABS(T11)-ABS(U11)-(V11+V12)/2+10>0,IF(T11<0,-(ABS(T11)-ABS(U11)-(V11+V12)/2+10),T11-ABS(U11)-(V11+V12)/2+10),0)),0)","v":0},null,null,null,{"$f":"IF(AND(Z11>0,Z12>0),IF(OR(Z11>10,Z11<0,Z12>10,Z12<0),\"Fehler\",IF(ABS(X11)-ABS(Y11)-(Z11+Z12)/2+10>0,IF(X11<0,-(ABS(X11)-ABS(Y11)-(Z11+Z12)/2+10),X11-ABS(Y11)-(Z11+Z12)/2+10),0)),0)","v":0},{"$f":"ABS(G11)+ABS(K11)+ABS(O11)+ABS(S11)+ABS(W11)+ABS(AA11)","v":0},null,null,null,"Boden",{"$f":"IF(G40>1,1,0)","v":0}]
[null,null,null,null,null,null,null,null,null,null,null,null,null,null,null,null,null,null,null,null,null,null,null,null,null,null,null,null,null,null,null,"pauschenpferd",{"$f":"IF(K40>1,1,0)","v":0}]
[{"$f":"'Wertungszettel M5'!A11","v":"frei 3"},{"$f":"IF(A13>0,B11,\"\")","v":"M5"},{"$f":"IF(A13<>\"\", VLOOKUP(A13,'Wertungszettel M5'!A$7:B$36,2,0),\"\")","v":0},null,null,null,{"$f":"IF(AND(F13>0,F14>0),IF(OR(F13>10,F13<0,F14>10,F14<0),\"Fehler\",IF(ABS(D13)-ABS(E13)-(F13+F14)/2+10>0,IF(D13<0,-(ABS(D13)-ABS(E13)-(F13+F14)/2+10),D13-ABS(E13)-(F13+F14)/2+10),0)),0)","v":0},null,null,null,{"$f":"IF(AND(J13>0,J14>0),IF(OR(J13>10,J13<0,J14>10,J14<0),\"Fehler\",IF(ABS(H13)-ABS(I13)-(J13+J14)/2+10>0,IF(H13<0,-(ABS(H13)-ABS(I13)-(J13+J14)/2+10),H13-ABS(I13)-(J13+J14)/2+10),0)),0)","v":0},null,null,null,{"$f":"IF(AND(N13>0,N14>0),IF(OR(N13>10,N13<0,N14>10,N14<0),\"Fehler\",IF(ABS(L13)-ABS(M13)-(N13+N14)/2+10>0,IF(L13<0,-(ABS(L13)-ABS(M13)-(N13+N14)/2+10),L13-ABS(M13)-(N13+N14)/2+10),0)),0)","v":0},null,null,null,{"$f":"IF(AND(R13>0,R14>0),IF(OR(R13>10,R13<0,R14>10,R14<0),\"Fehler\",IF(ABS(P13)-ABS(Q13)-(R13+R14)/2+10>0,IF(P13<0,-(ABS(P13)-ABS(Q13)-(R13+R14)/2+10),P13-ABS(Q13)-(R13+R14)/2+10),0)),0)","v":0},null,null,null,{"$f":"IF(AND(V13>0,V14>0),IF(OR(V13>10,V13<0,V14>10,V14<0),\"Fehler\",IF(ABS(T13)-ABS(U13)-(V13+V14)/2+10>0,IF(T13<0,-(ABS(T13)-ABS(U13)-(V13+V14)/2+10),T13-ABS(U13)-(V13+V14)/2+10),0)),0)","v":0},null,null,null,{"$f":"IF(AND(Z13>0,Z14>0),IF(OR(Z13>10,Z13<0,Z14>10,Z14<0),\"Fehler\",IF(ABS(X13)-ABS(Y13)-(Z13+Z14)/2+10>0,IF(X13<0,-(ABS(X13)-ABS(Y13)-(Z13+Z14)/2+10),X13-ABS(Y13)-(Z13+Z14)/2+10),0)),0)","v":0},{"$f":"ABS(G13)+ABS(K13)+ABS(O13)+ABS(S13)+ABS(W13)+ABS(AA13)","v":0},null,null,null,"ringe",{"$f":"IF(O40>1,1,0)","v":0}]
[null,null,null,null,null,null,null,null,null,null,null,null,null,null,null,null,null,null,null,null,null,null,null,null,null,null,null,null,null,null,null,"sprung",{"$f":"IF(S40>1,1,0)","v":0}]
[{"$f":"'Wertungszettel M5'!A13","v":"frei 4"},{"$f":"IF(A15>0,B13,\"\")","v":"M5"},{"$f":"IF(A15<>\"\", VLOOKUP(A15,'Wertungszettel M5'!A$7:B$36,2,0),\"\")","v":0},null,null,null,{"$f":"IF(AND(F15>0,F16>0),IF(OR(F15>10,F15<0,F16>10,F16<0),\"Fehler\",IF(ABS(D15)-ABS(E15)-(F15+F16)/2+10>0,IF(D15<0,-(ABS(D15)-ABS(E15)-(F15+F16)/2+10),D15-ABS(E15)-(F15+F16)/2+10),0)),0)","v":0},null,null,null,{"$f":"IF(AND(J15>0,J16>0),IF(OR(J15>10,J15<0,J16>10,J16<0),\"Fehler\",IF(ABS(H15)-ABS(I15)-(J15+J16)/2+10>0,IF(H15<0,-(ABS(H15)-ABS(I15)-(J15+J16)/2+10),H15-ABS(I15)-(J15+J16)/2+10),0)),0)","v":0},null,null,null,{"$f":"IF(AND(N15>0,N16>0),IF(OR(N15>10,N15<0,N16>10,N16<0),\"Fehler\",IF(ABS(L15)-ABS(M15)-(N15+N16)/2+10>0,IF(L15<0,-(ABS(L15)-ABS(M15)-(N15+N16)/2+10),L15-ABS(M15)-(N15+N16)/2+10),0)),0)","v":0},null,null,null,{"$f":"IF(AND(R15>0,R16>0),IF(OR(R15>10,R15<0,R16>10,R16<0),\"Fehler\",IF(ABS(P15)-ABS(Q15)-(R15+R16)/2+10>0,IF(P15<0,-(ABS(P15)-ABS(Q15)-(R15+R16)/2+10),P15-ABS(Q15)-(R15+R16)/2+10),0)),0)","v":0},null,null,null,{"$f":"IF(AND(V15>0,V16>0),IF(OR(V15>10,V15<0,V16>10,V16<0),\"Fehler\",IF(ABS(T15)-ABS(U15)-(V15+V16)/2+10>0,IF(T15<0,-(ABS(T15)-ABS(U15)-(V15+V16)/2+10),T15-ABS(U15)-(V15+V16)/2+10),0)),0)","v":0},null,null,null,{"$f":"IF(AND(Z15>0,Z16>0),IF(OR(Z15>10,Z15<0,Z16>10,Z16<0),\"Fehler\",IF(ABS(X15)-ABS(Y15)-(Z15+Z16)/2+10>0,IF(X15<0,-(ABS(X15)-ABS(Y15)-(Z15+Z16)/2+10),X15-ABS(Y15)-(Z15+Z16)/2+10),0)),0)","v":0},{"$f":"ABS(G15)+ABS(K15)+ABS(O15)+ABS(S15)+ABS(W15)+ABS(AA15)","v":0},null,null,null,"Barren",{"$f":"IF(W40>1,1,0)","v":0}]
[null,null,null,null,null,null,null,null,null,null,null,null,null,null,null,null,null,null,null,null,null,null,null,null,null,null,null,null,null,null,null,"Reck",{"$f":"IF(AA40>1,1,0)","v":0}]
[{"$f":"'Wertungszettel M5'!A15","v":"frei 5"},{"$f":"IF(A17>0,B15,\"\")","v":"M5"},{"$f":"IF(A17<>\"\", VLOOKUP(A17,'Wertungszettel M5'!A$7:B$36,2,0),\"\")","v":0},null,null,null,{"$f":"IF(AND(F17>0,F18>0),IF(OR(F17>10,F17<0,F18>10,F18<0),\"Fehler\",IF(ABS(D17)-ABS(E17)-(F17+F18)/2+10>0,IF(D17<0,-(ABS(D17)-ABS(E17)-(F17+F18)/2+10),D17-ABS(E17)-(F17+F18)/2+10),0)),0)","v":0},null,null,null,{"$f":"IF(AND(J17>0,J18>0),IF(OR(J17>10,J17<0,J18>10,J18<0),\"Fehler\",IF(ABS(H17)-ABS(I17)-(J17+J18)/2+10>0,IF(H17<0,-(ABS(H17)-ABS(I17)-(J17+J18)/2+10),H17-ABS(I17)-(J17+J18)/2+10),0)),0)","v":0},null,null,null,{"$f":"IF(AND(N17>0,N18>0),IF(OR(N17>10,N17<0,N18>10,N18<0),\"Fehler\",IF(ABS(L17)-ABS(M17)-(N17+N18)/2+10>0,IF(L17<0,-(ABS(L17)-ABS(M17)-(N17+N18)/2+10),L17-ABS(M17)-(N17+N18)/2+10),0)),0)","v":0},null,null,null,{"$f":"IF(AND(R17>0,R18>0),IF(OR(R17>10,R17<0,R18>10,R18<0),\"Fehler\",IF(ABS(P17)-ABS(Q17)-(R17+R18)/2+10>0,IF(P17<0,-(ABS(P17)-ABS(Q17)-(R17+R18)/2+10),P17-ABS(Q17)-(R17+R18)/2+10),0)),0)","v":0},null,null,null,{"$f":"IF(AND(V17>0,V18>0),IF(OR(V17>10,V17<0,V18>10,V18<0),\"Fehler\",IF(ABS(T17)-ABS(U17)-(V17+V18)/2+10>0,IF(T17<0,-(ABS(T17)-ABS(U17)-(V17+V18)/2+10),T17-ABS(U17)-(V17+V18)/2+10),0)),0)","v":0},null,null,null,{"$f":"IF(AND(Z17>0,Z18>0),IF(OR(Z17>10,Z17<0,Z18>10,Z18<0),\"Fehler\",IF(ABS(X17)-ABS(Y17)-(Z17+Z18)/2+10>0,IF(X17<0,-(ABS(X17)-ABS(Y17)-(Z17+Z18)/2+10),X17-ABS(Y17)-(Z17+Z18)/2+10),0)),0)","v":0},{"$f":"ABS(G17)+ABS(K17)+ABS(O17)+ABS(S17)+ABS(W17)+ABS(AA17)","v":0}]
[null,null,null,null,null,null,null,null,null,null,null,null,null,null,null,null,null,null,null,null,null,null,null,null,null,null,null,null,null,null,null,"Gesamt",{"$f":"SUM(AG11:AG17)","v":0}]
[{"$f":"'Wertungszettel M5'!A17","v":"frei 6"},{"$f":"IF(A19>0,B17,\"\")","v":"M5"},{"$f":"IF(A19<>\"\", VLOOKUP(A19,'Wertungszettel M5'!A$7:B$36,2,0),\"\")","v":0},null,null,null,{"$f":"IF(AND(F19>0,F20>0),IF(OR(F19>10,F19<0,F20>10,F20<0),\"Fehler\",IF(ABS(D19)-ABS(E19)-(F19+F20)/2+10>0,IF(D19<0,-(ABS(D19)-ABS(E19)-(F19+F20)/2+10),D19-ABS(E19)-(F19+F20)/2+10),0)),0)","v":0},null,null,null,{"$f":"IF(AND(J19>0,J20>0),IF(OR(J19>10,J19<0,J20>10,J20<0),\"Fehler\",IF(ABS(H19)-ABS(I19)-(J19+J20)/2+10>0,IF(H19<0,-(ABS(H19)-ABS(I19)-(J19+J20)/2+10),H19-ABS(I19)-(J19+J20)/2+10),0)),0)","v":0},null,null,null,{"$f":"IF(AND(N19>0,N20>0),IF(OR(N19>10,N19<0,N20>10,N20<0),\"Fehler\",IF(ABS(L19)-ABS(M19)-(N19+N20)/2+10>0,IF(L19<0,-(ABS(L19)-ABS(M19)-(N19+N20)/2+10),L19-ABS(M19)-(N19+N20)/2+10),0)),0)","v":0},null,null,null,{"$f":"IF(AND(R19>0,R20>0),IF(OR(R19>10,R19<0,R20>10,R20<0),\"Fehler\",IF(ABS(P19)-ABS(Q19)-(R19+R20)/2+10>0,IF(P19<0,-(ABS(P19)-ABS(Q19)-(R19+R20)/2+10),P19-ABS(Q19)-(R19+R20)/2+10),0)),0)","v":0},null,null,null,{"$f":"IF(AND(V19>0,V20>0),IF(OR(V19>10,V19<0,V20>10,V20<0),\"Fehler\",IF(ABS(T19)-ABS(U19)-(V19+V20)/2+10>0,IF(T19<0,-(ABS(T19)-ABS(U19)-(V19+V20)/2+10),T19-ABS(U19)-(V19+V20)/2+10),0)),0)","v":0},null,null,null,{"$f":"IF(AND(Z19>0,Z20>0),IF(OR(Z19>10,Z19<0,Z20>10,Z20<0),\"Fehler\",IF(ABS(X19)-ABS(Y19)-(Z19+Z20)/2+10>0,IF(X19<0,-(ABS(X19)-ABS(Y19)-(Z19+Z20)/2+10),X19-ABS(Y19)-(Z19+Z20)/2+10),0)),0)","v":0},{"$f":"ABS(G19)+ABS(K19)+ABS(O19)+ABS(S19)+ABS(W19)+ABS(AA19)","v":0}]
[]
[{"$f":"'Wertungszettel M5'!A19","v":"frei 7"},{"$f":"IF(A21>0,B19,\"\")","v":"M5"},{"$f":"IF(A21<>\"\", VLOOKUP(A21,'Wertungszettel M5'!A$7:B$36,2,0),\"\")","v":0},null,null,null,{"$f":"IF(AND(F21>0,F22>0),IF(OR(F21>10,F21<0,F22>10,F22<0),\"Fehler\",IF(ABS(D21)-ABS(E21)-(F21+F22)/2+10>0,IF(D21<0,-(ABS(D21)-ABS(E21)-(F21+F22)/2+10),D21-ABS(E21)-(F21+F22)/2+10),0)),0)","v":0},null,null,null,{"$f":"IF(AND(J21>0,J22>0),IF(OR(J21>10,J21<0,J22>10,J22<0),\"Fehler\",IF(ABS(H21)-ABS(I21)-(J21+J22)/2+10>0,IF(H21<0,-(ABS(H21)-ABS(I21)-(J21+J22)/2+10),H21-ABS(I21)-(J21+J22)/2+10),0)),0)","v":0},null,null,null,{"$f":"IF(AND(N21>0,N22>0),IF(OR(N21>10,N21<0,N22>10,N22<0),\"Fehler\",IF(ABS(L21)-ABS(M21)-(N21+N22)/2+10>0,IF(L21<0,-(ABS(L21)-ABS(M21)-(N21+N22)/2+10),L21-ABS(M21)-(N21+N22)/2+10),0)),0)","v":0},null,null,null,{"$f":"IF(AND(R21>0,R22>0),IF(OR(R21>10,R21<0,R22>10,R22<0),\"Fehler\",IF(ABS(P21)-ABS(Q21)-(R21+R22)/2+10>0,IF(P21<0,-(ABS(P21)-ABS(Q21)-(R21+R22)/2+10),P21-ABS(Q21)-(R21+R22)/2+10),0)),0)","v":0},null,null,null,{"$f":"IF(AND(V21>0,V22>0),IF(OR(V21>10,V21<0,V22>10,V22<0),\"Fehler\",IF(ABS(T21)-ABS(U21)-(V21+V22)/2+10>0,IF(T21<0,-(ABS(T21)-ABS(U21)-(V21+V22)/2+10),T21-ABS(U21)-(V21+V22)/2+10),0)),0)","v":0},null,null,null,{"$f":"IF(AND(Z21>0,Z22>0),IF(OR(Z21>10,Z21<0,Z22>10,Z22<0),\"Fehler\",IF(ABS(X21)-ABS(Y21)-(Z21+Z22)/2+10>0,IF(X21<0,-(ABS(X21)-ABS(Y21)-(Z21+Z22)/2+10),X21-ABS(Y21)-(Z21+Z22)/2+10),0)),0)","v":0},{"$f":"ABS(G21)+ABS(K21)+ABS(O21)+ABS(S21)+ABS(W21)+ABS(AA21)","v":0}]
[]
[{"$f":"'Wertungszettel M5'!A21","v":"frei 8"},{"$f":"IF(A23>0,B21,\"\")","v":"M5"},{"$f":"IF(A23<>\"\", VLOOKUP(A23,'Wertungszettel M5'!A$7:B$36,2,0),\"\")","v":0},null,null,null,{"$f":"IF(AND(F23>0,F24>0),IF(OR(F23>10,F23<0,F24>10,F24<0),\"Fehler\",IF(ABS(D23)-ABS(E23)-(F23+F24)/2+10>0,IF(D23<0,-(ABS(D23)-ABS(E23)-(F23+F24)/2+10),D23-ABS(E23)-(F23+F24)/2+10),0)),0)","v":0},null,null,null,{"$f":"IF(AND(J23>0,J24>0),IF(OR(J23>10,J23<0,J24>10,J24<0),\"Fehler\",IF(ABS(H23)-ABS(I23)-(J23+J24)/2+10>0,IF(H23<0,-(ABS(H23)-ABS(I23)-(J23+J24)/2+10),H23-ABS(I23)-(J23+J24)/2+10),0)),0)","v":0},null,null,null,{"$f":"IF(AND(N23>0,N24>0),IF(OR(N23>10,N23<0,N24>10,N24<0),\"Fehler\",IF(ABS(L23)-ABS(M23)-(N23+N24)/2+10>0,IF(L23<0,-(ABS(L23)-ABS(M23)-(N23+N24)/2+10),L23-ABS(M23)-(N23+N24)/2+10),0)),0)","v":0},null,null,null,{"$f":"IF(AND(R23>0,R24>0),IF(OR(R23>10,R23<0,R24>10,R24<0),\"Fehler\",IF(ABS(P23)-ABS(Q23)-(R23+R24)/2+10>0,IF(P23<0,-(ABS(P23)-ABS(Q23)-(R23+R24)/2+10),P23-ABS(Q23)-(R23+R24)/2+10),0)),0)","v":0},null,null,null,{"$f":"IF(AND(V23>0,V24>0),IF(OR(V23>10,V23<0,V24>10,V24<0),\"Fehler\",IF(ABS(T23)-ABS(U23)-(V23+V24)/2+10>0,IF(T23<0,-(ABS(T23)-ABS(U23)-(V23+V24)/2+10),T23-ABS(U23)-(V23+V24)/2+10),0)),0)","v":0},null,null,null,{"$f":"IF(AND(Z23>0,Z24>0),IF(OR(Z23>10,Z23<0,Z24>10,Z24<0),\"Fehler\",IF(ABS(X23)-ABS(Y23)-(Z23+Z24)/2+10>0,IF(X23<0,-(ABS(X23)-ABS(Y23)-(Z23+Z24)/2+10),X23-ABS(Y23)-(Z23+Z24)/2+10),0)),0)","v":0},{"$f":"ABS(G23)+ABS(K23)+ABS(O23)+ABS(S23)+ABS(W23)+ABS(AA23)","v":0}]
[]
[{"$f":"'Wertungszettel M5'!A23","v":"frei 9"},{"$f":"IF(A25>0,B23,\"\")","v":"M5"},{"$f":"IF(A25<>\"\", VLOOKUP(A25,'Wertungszettel M5'!A$7:B$36,2,0),\"\")","v":0},null,null,null,{"$f":"IF(AND(F25>0,F26>0),IF(OR(F25>10,F25<0,F26>10,F26<0),\"Fehler\",IF(ABS(D25)-ABS(E25)-(F25+F26)/2+10>0,IF(D25<0,-(ABS(D25)-ABS(E25)-(F25+F26)/2+10),D25-ABS(E25)-(F25+F26)/2+10),0)),0)","v":0},null,null,null,{"$f":"IF(AND(J25>0,J26>0),IF(OR(J25>10,J25<0,J26>10,J26<0),\"Fehler\",IF(ABS(H25)-ABS(I25)-(J25+J26)/2+10>0,IF(H25<0,-(ABS(H25)-ABS(I25)-(J25+J26)/2+10),H25-ABS(I25)-(J25+J26)/2+10),0)),0)","v":0},null,null,null,{"$f":"IF(AND(N25>0,N26>0),IF(OR(N25>10,N25<0,N26>10,N26<0),\"Fehler\",IF(ABS(L25)-ABS(M25)-(N25+N26)/2+10>0,IF(L25<0,-(ABS(L25)-ABS(M25)-(N25+N26)/2+10),L25-ABS(M25)-(N25+N26)/2+10),0)),0)","v":0},null,null,null,{"$f":"IF(AND(R25>0,R26>0),IF(OR(R25>10,R25<0,R26>10,R26<0),\"Fehler\",IF(ABS(P25)-ABS(Q25)-(R25+R26)/2+10>0,IF(P25<0,-(ABS(P25)-ABS(Q25)-(R25+R26)/2+10),P25-ABS(Q25)-(R25+R26)/2+10),0)),0)","v":0},null,null,null,{"$f":"IF(AND(V25>0,V26>0),IF(OR(V25>10,V25<0,V26>10,V26<0),\"Fehler\",IF(ABS(T25)-ABS(U25)-(V25+V26)/2+10>0,IF(T25<0,-(ABS(T25)-ABS(U25)-(V25+V26)/2+10),T25-ABS(U25)-(V25+V26)/2+10),0)),0)","v":0},null,null,null,{"$f":"IF(AND(Z25>0,Z26>0),IF(OR(Z25>10,Z25<0,Z26>10,Z26<0),\"Fehler\",IF(ABS(X25)-ABS(Y25)-(Z25+Z26)/2+10>0,IF(X25<0,-(ABS(X25)-ABS(Y25)-(Z25+Z26)/2+10),X25-ABS(Y25)-(Z25+Z26)/2+10),0)),0)","v":0},{"$f":"ABS(G25)+ABS(K25)+ABS(O25)+ABS(S25)+ABS(W25)+ABS(AA25)","v":0}]
[]
[{"$f":"'Wertungszettel M5'!A25","v":"frei 10"},{"$f":"IF(A27>0,B25,\"\")","v":"M5"},{"$f":"IF(A27<>\"\", VLOOKUP(A27,'Wertungszettel M5'!A$7:B$36,2,0),\"\")","v":0},null,null,null,{"$f":"IF(AND(F27>0,F28>0),IF(OR(F27>10,F27<0,F28>10,F28<0),\"Fehler\",IF(ABS(D27)-ABS(E27)-(F27+F28)/2+10>0,IF(D27<0,-(ABS(D27)-ABS(E27)-(F27+F28)/2+10),D27-ABS(E27)-(F27+F28)/2+10),0)),0)","v":0},null,null,null,{"$f":"IF(AND(J27>0,J28>0),IF(OR(J27>10,J27<0,J28>10,J28<0),\"Fehler\",IF(ABS(H27)-ABS(I27)-(J27+J28)/2+10>0,IF(H27<0,-(ABS(H27)-ABS(I27)-(J27+J28)/2+10),H27-ABS(I27)-(J27+J28)/2+10),0)),0)","v":0},null,null,null,{"$f":"IF(AND(N27>0,N28>0),IF(OR(N27>10,N27<0,N28>10,N28<0),\"Fehler\",IF(ABS(L27)-ABS(M27)-(N27+N28)/2+10>0,IF(L27<0,-(ABS(L27)-ABS(M27)-(N27+N28)/2+10),L27-ABS(M27)-(N27+N28)/2+10),0)),0)","v":0},null,null,null,{"$f":"IF(AND(R27>0,R28>0),IF(OR(R27>10,R27<0,R28>10,R28<0),\"Fehler\",IF(ABS(P27)-ABS(Q27)-(R27+R28)/2+10>0,IF(P27<0,-(ABS(P27)-ABS(Q27)-(R27+R28)/2+10),P27-ABS(Q27)-(R27+R28)/2+10),0)),0)","v":0},null,null,null,{"$f":"IF(AND(V27>0,V28>0),IF(OR(V27>10,V27<0,V28>10,V28<0),\"Fehler\",IF(ABS(T27)-ABS(U27)-(V27+V28)/2+10>0,IF(T27<0,-(ABS(T27)-ABS(U27)-(V27+V28)/2+10),T27-ABS(U27)-(V27+V28)/2+10),0)),0)","v":0},null,null,null,{"$f":"IF(AND(Z27>0,Z28>0),IF(OR(Z27>10,Z27<0,Z28>10,Z28<0),\"Fehler\",IF(ABS(X27)-ABS(Y27)-(Z27+Z28)/2+10>0,IF(X27<0,-(ABS(X27)-ABS(Y27)-(Z27+Z28)/2+10),X27-ABS(Y27)-(Z27+Z28)/2+10),0)),0)","v":0},{"$f":"ABS(G27)+ABS(K27)+ABS(O27)+ABS(S27)+ABS(W27)+ABS(AA27)","v":0}]
[]
[{"$f":"'Wertungszettel M5'!A27","v":"frei 11"},{"$f":"IF(A29>0,B27,\"\")","v":"M5"},{"$f":"IF(A29<>\"\", VLOOKUP(A29,'Wertungszettel M5'!A$7:B$36,2,0),\"\")","v":0},null,null,null,{"$f":"IF(AND(F29>0,F30>0),IF(OR(F29>10,F29<0,F30>10,F30<0),\"Fehler\",IF(ABS(D30)-ABS(E30)-(F29+F30)/2+10>0,IF(D30<0,-(ABS(D30)-ABS(E30)-(F29+F30)/2+10),D29-ABS(E29)-(F29+F30)/2+10),0)),0)","v":0},null,null,null,{"$f":"IF(AND(J29>0,J30>0),IF(OR(J29>10,J29<0,J30>10,J30<0),\"Fehler\",IF(ABS(H30)-ABS(I30)-(J29+J30)/2+10>0,IF(H30<0,-(ABS(H30)-ABS(I30)-(J29+J30)/2+10),H29-ABS(I29)-(J29+J30)/2+10),0)),0)","v":0},null,null,null,{"$f":"IF(AND(N29>0,N30>0),IF(OR(N29>10,N29<0,N30>10,N30<0),\"Fehler\",IF(ABS(L30)-ABS(M30)-(N29+N30)/2+10>0,IF(L30<0,-(ABS(L30)-ABS(M30)-(N29+N30)/2+10),L29-ABS(M29)-(N29+N30)/2+10),0)),0)","v":0},null,null,null,{"$f":"IF(AND(R29>0,R30>0),IF(OR(R29>10,R29<0,R30>10,R30<0),\"Fehler\",IF(ABS(P30)-ABS(Q30)-(R29+R30)/2+10>0,IF(P30<0,-(ABS(P30)-ABS(Q30)-(R29+R30)/2+10),P29-ABS(Q29)-(R29+R30)/2+10),0)),0)","v":0},null,null,null,{"$f":"IF(AND(V29>0,V30>0),IF(OR(V29>10,V29<0,V30>10,V30<0),\"Fehler\",IF(ABS(T30)-ABS(U30)-(V29+V30)/2+10>0,IF(T30<0,-(ABS(T30)-ABS(U30)-(V29+V30)/2+10),T29-ABS(U29)-(V29+V30)/2+10),0)),0)","v":0},null,null,null,{"$f":"IF(AND(Z29>0,Z30>0),IF(OR(Z29>10,Z29<0,Z30>10,Z30<0),\"Fehler\",IF(ABS(X30)-ABS(Y30)-(Z29+Z30)/2+10>0,IF(X30<0,-(ABS(X30)-ABS(Y30)-(Z29+Z30)/2+10),X29-ABS(Y29)-(Z29+Z30)/2+10),0)),0)","v":0},{"$f":"ABS(G29)+ABS(K29)+ABS(O29)+ABS(S29)+ABS(W29)+ABS(AA29)","v":0}]
[]
[{"$f":"'Wertungszettel M5'!A29","v":"frei 12"},{"$f":"IF(A31>0,B29,\"\")","v":"M5"},{"$f":"IF(A31<>\"\", VLOOKUP(A31,'Wertungszettel M5'!A$7:B$36,2,0),\"\")","v":0},null,null,null,{"$f":"IF(AND(F31>0,F32>0),IF(OR(F31>10,F31<0,F32>10,F32<0),\"Fehler\",IF(ABS(D32)-ABS(E32)-(F31+F32)/2+10>0,IF(D32<0,-(ABS(D32)-ABS(E32)-(F31+F32)/2+10),D31-ABS(E31)-(F31+F32)/2+10),0)),0)","v":0},null,null,null,{"$f":"IF(AND(J31>0,J32>0),IF(OR(J31>10,J31<0,J32>10,J32<0),\"Fehler\",IF(ABS(H32)-ABS(I32)-(J31+J32)/2+10>0,IF(H32<0,-(ABS(H32)-ABS(I32)-(J31+J32)/2+10),H31-ABS(I31)-(J31+J32)/2+10),0)),0)","v":0},null,null,null,{"$f":"IF(AND(N31>0,N32>0),IF(OR(N31>10,N31<0,N32>10,N32<0),\"Fehler\",IF(ABS(L32)-ABS(M32)-(N31+N32)/2+10>0,IF(L32<0,-(ABS(L32)-ABS(M32)-(N31+N32)/2+10),L31-ABS(M31)-(N31+N32)/2+10),0)),0)","v":0},null,null,null,{"$f":"IF(AND(R31>0,R32>0),IF(OR(R31>10,R31<0,R32>10,R32<0),\"Fehler\",IF(ABS(P32)-ABS(Q32)-(R31+R32)/2+10>0,IF(P32<0,-(ABS(P32)-ABS(Q32)-(R31+R32)/2+10),P31-ABS(Q31)-(R31+R32)/2+10),0)),0)","v":0},null,null,null,{"$f":"IF(AND(V31>0,V32>0),IF(OR(V31>10,V31<0,V32>10,V32<0),\"Fehler\",IF(ABS(T32)-ABS(U32)-(V31+V32)/2+10>0,IF(T32<0,-(ABS(T32)-ABS(U32)-(V31+V32)/2+10),T31-ABS(U31)-(V31+V32)/2+10),0)),0)","v":0},null,null,null,{"$f":"IF(AND(Z31>0,Z32>0),IF(OR(Z31>10,Z31<0,Z32>10,Z32<0),\"Fehler\",IF(ABS(X32)-ABS(Y32)-(Z31+Z32)/2+10>0,IF(X32<0,-(ABS(X32)-ABS(Y32)-(Z31+Z32)/2+10),X31-ABS(Y31)-(Z31+Z32)/2+10),0)),0)","v":0},{"$f":"ABS(G31)+ABS(K31)+ABS(O31)+ABS(S31)+ABS(W31)+ABS(AA31)","v":0}]
[]
[{"$f":"'Wertungszettel M5'!A31","v":"frei 13"},{"$f":"IF(A33>0,B31,\"\")","v":"M5"},{"$f":"IF(A33<>\"\", VLOOKUP(A33,'Wertungszettel M5'!A$7:B$36,2,0),\"\")","v":0},null,null,null,{"$f":"IF(AND(F33>0,F34>0),IF(OR(F33>10,F33<0,F34>10,F34<0),\"Fehler\",IF(ABS(D34)-ABS(E34)-(F33+F34)/2+10>0,IF(D34<0,-(ABS(D34)-ABS(E34)-(F33+F34)/2+10),D33-ABS(E33)-(F33+F34)/2+10),0)),0)","v":0},null,null,null,{"$f":"IF(AND(J33>0,J34>0),IF(OR(J33>10,J33<0,J34>10,J34<0),\"Fehler\",IF(ABS(H34)-ABS(I34)-(J33+J34)/2+10>0,IF(H34<0,-(ABS(H34)-ABS(I34)-(J33+J34)/2+10),H33-ABS(I33)-(J33+J34)/2+10),0)),0)","v":0},null,null,null,{"$f":"IF(AND(N33>0,N34>0),IF(OR(N33>10,N33<0,N34>10,N34<0),\"Fehler\",IF(ABS(L34)-ABS(M34)-(N33+N34)/2+10>0,IF(L34<0,-(ABS(L34)-ABS(M34)-(N33+N34)/2+10),L33-ABS(M33)-(N33+N34)/2+10),0)),0)","v":0},null,null,null,{"$f":"IF(AND(R33>0,R34>0),IF(OR(R33>10,R33<0,R34>10,R34<0),\"Fehler\",IF(ABS(P34)-ABS(Q34)-(R33+R34)/2+10>0,IF(P34<0,-(ABS(P34)-ABS(Q34)-(R33+R34)/2+10),P33-ABS(Q33)-(R33+R34)/2+10),0)),0)","v":0},null,null,null,{"$f":"IF(AND(V33>0,V34>0),IF(OR(V33>10,V33<0,V34>10,V34<0),\"Fehler\",IF(ABS(T34)-ABS(U34)-(V33+V34)/2+10>0,IF(T34<0,-(ABS(T34)-ABS(U34)-(V33+V34)/2+10),T33-ABS(U33)-(V33+V34)/2+10),0)),0)","v":0},null,null,null,{"$f":"IF(AND(Z33>0,Z34>0),IF(OR(Z33>10,Z33<0,Z34>10,Z34<0),\"Fehler\",IF(ABS(X34)-ABS(Y34)-(Z33+Z34)/2+10>0,IF(X34<0,-(ABS(X34)-ABS(Y34)-(Z33+Z34)/2+10),X33-ABS(Y33)-(Z33+Z34)/2+10),0)),0)","v":0},{"$f":"ABS(G33)+ABS(K33)+ABS(O33)+ABS(S33)+ABS(W33)+ABS(AA33)","v":0}]
[]
[{"$f":"'Wertungszettel M5'!A33","v":"frei 14"},{"$f":"IF(A35>0,B33,\"\")","v":"M5"},{"$f":"IF(A35<>\"\", VLOOKUP(A35,'Wertungszettel M5'!A$7:B$36,2,0),\"\")","v":0},null,null,null,{"$f":"IF(AND(F35>0,F36>0),IF(OR(F35>10,F35<0,F36>10,F36<0),\"Fehler\",IF(ABS(D36)-ABS(E36)-(F35+F36)/2+10>0,IF(D36<0,-(ABS(D36)-ABS(E36)-(F35+F36)/2+10),D35-ABS(E35)-(F35+F36)/2+10),0)),0)","v":0},null,null,null,{"$f":"IF(AND(J35>0,J36>0),IF(OR(J35>10,J35<0,J36>10,J36<0),\"Fehler\",IF(ABS(H36)-ABS(I36)-(J35+J36)/2+10>0,IF(H36<0,-(ABS(H36)-ABS(I36)-(J35+J36)/2+10),H35-ABS(I35)-(J35+J36)/2+10),0)),0)","v":0},null,null,null,{"$f":"IF(AND(N35>0,N36>0),IF(OR(N35>10,N35<0,N36>10,N36<0),\"Fehler\",IF(ABS(L36)-ABS(M36)-(N35+N36)/2+10>0,IF(L36<0,-(ABS(L36)-ABS(M36)-(N35+N36)/2+10),L35-ABS(M35)-(N35+N36)/2+10),0)),0)","v":0},null,null,null,{"$f":"IF(AND(R35>0,R36>0),IF(OR(R35>10,R35<0,R36>10,R36<0),\"Fehler\",IF(ABS(P36)-ABS(Q36)-(R35+R36)/2+10>0,IF(P36<0,-(ABS(P36)-ABS(Q36)-(R35+R36)/2+10),P35-ABS(Q35)-(R35+R36)/2+10),0)),0)","v":0},null,null,null,{"$f":"IF(AND(V35>0,V36>0),IF(OR(V35>10,V35<0,V36>10,V36<0),\"Fehler\",IF(ABS(T36)-ABS(U36)-(V35+V36)/2+10>0,IF(T36<0,-(ABS(T36)-ABS(U36)-(V35+V36)/2+10),T35-ABS(U35)-(V35+V36)/2+10),0)),0)","v":0},null,null,null,{"$f":"IF(AND(Z35>0,Z36>0),IF(OR(Z35>10,Z35<0,Z36>10,Z36<0),\"Fehler\",IF(ABS(X36)-ABS(Y36)-(Z35+Z36)/2+10>0,IF(X36<0,-(ABS(X36)-ABS(Y36)-(Z35+Z36)/2+10),X35-ABS(Y35)-(Z35+Z36)/2+10),0)),0)","v":0},{"$f":"ABS(G35)+ABS(K35)+ABS(O35)+ABS(S35)+ABS(W35)+ABS(AA35)","v":0}]
[]
[{"$f":"'Wertungszettel M5'!A35","v":"frei 15"},{"$f":"IF(A37>0,B35,\"\")","v":"M5"},{"$f":"IF(A37<>\"\", VLOOKUP(A37,'Wertungszettel M5'!A$7:B$36,2,0),\"\")","v":0},null,null,null,{"$f":"IF(AND(F37>0,F38>0),IF(OR(F37>10,F37<0,F38>10,F38<0),\"Fehler\",IF(ABS(D38)-ABS(E38)-(F37+F38)/2+10>0,IF(D38<0,-(ABS(D38)-ABS(E38)-(F37+F38)/2+10),D37-ABS(E37)-(F37+F38)/2+10),0)),0)","v":0},null,null,null,{"$f":"IF(AND(J37>0,J38>0),IF(OR(J37>10,J37<0,J38>10,J38<0),\"Fehler\",IF(ABS(H38)-ABS(I38)-(J37+J38)/2+10>0,IF(H38<0,-(ABS(H38)-ABS(I38)-(J37+J38)/2+10),H37-ABS(I37)-(J37+J38)/2+10),0)),0)","v":0},null,null,null,{"$f":"IF(AND(N37>0,N38>0),IF(OR(N37>10,N37<0,N38>10,N38<0),\"Fehler\",IF(ABS(L38)-ABS(M38)-(N37+N38)/2+10>0,IF(L38<0,-(ABS(L38)-ABS(M38)-(N37+N38)/2+10),L37-ABS(M37)-(N37+N38)/2+10),0)),0)","v":0},null,null,null,{"$f":"IF(AND(R37>0,R38>0),IF(OR(R37>10,R37<0,R38>10,R38<0),\"Fehler\",IF(ABS(P38)-ABS(Q38)-(R37+R38)/2+10>0,IF(P38<0,-(ABS(P38)-ABS(Q38)-(R37+R38)/2+10),P37-ABS(Q37)-(R37+R38)/2+10),0)),0)","v":0},null,null,null,{"$f":"IF(AND(V37>0,V38>0),IF(OR(V37>10,V37<0,V38>10,V38<0),\"Fehler\",IF(ABS(T38)-ABS(U38)-(V37+V38)/2+10>0,IF(T38<0,-(ABS(T38)-ABS(U38)-(V37+V38)/2+10),T37-ABS(U37)-(V37+V38)/2+10),0)),0)","v":0},null,null,null,{"$f":"IF(AND(Z37>0,Z38>0),IF(OR(Z37>10,Z37<0,Z38>10,Z38<0),\"Fehler\",IF(ABS(X38)-ABS(Y38)-(Z37+Z38)/2+10>0,IF(X38<0,-(ABS(X38)-ABS(Y38)-(Z37+Z38)/2+10),X37-ABS(Y37)-(Z37+Z38)/2+10),0)),0)","v":0},{"$f":"ABS(G37)+ABS(K37)+ABS(O37)+ABS(S37)+ABS(W37)+ABS(AA37)","v":0}]
[]
[]
[null,null,null,null,null,null,{"$f":"SUM(LARGE(G9:G38,1),LARGE(G9:G38,2),LARGE(G9:G38,3))","v":0},null,null,null,{"$f":"SUM(LARGE(K9:K38,1),LARGE(K9:K38,2),LARGE(K9:K38,3))","v":0},null,null,null,{"$f":"SUM(LARGE(O9:O38,1),LARGE(O9:O38,2),LARGE(O9:O38,3))","v":0},null,null,null,{"$f":"SUM(LARGE(S9:S38,1),LARGE(S9:S38,2),LARGE(S9:S38,3))","v":0},null,null,null,{"$f":"SUM(LARGE(W9:W38,1),LARGE(W9:W38,2),LARGE(W9:W38,3))","v":0},null,null,null,{"$f":"SUM(LARGE(AA9:AA38,1),LARGE(AA9:AA38,2),LARGE(AA9:AA38,3))","v":0},{"$f":"SUM(G40,K40,O40,S40,W40,AA40)","v":0}]

{"sheet":"M6","index":9,"n_rows":40,"n_cols":33,"rows_kept":40,"cut":false,"hidden":false,"merged":[[36,26,37,26],[36,27,37,27],[34,23,35,23],[34,24,35,24],[34,26,35,26],[34,27,35,27],[36,0,37,0],[36,1,37,1],[36,2,37,2],[36,3,37,3],[36,4,37,4],[36,6,37,6],[36,7,37,7],[36,8,37,8],[36,10,37,10],[36,11,37,11],[36,12,37,12],[36,14,37,14],[36,15,37,15],[36,16,37,16],[36,18,37,18],[36,19,37,19],[36,20,37,20],[36,22,37,22],[36,23,37,23],[36,24,37,24],[34,11,35,11],[34,12,35,12],[34,14,35,14],[34,15,35,15],[34,16,35,16],[34,18,35,18],[34,19,35,19],[34,20,35,20],[34,22,35,22],[34,0,35,0],[34,1,35,1],[34,2,35,2],[34,3,35,3],[34,4,35,4],[34,6,35,6],[34,7,35,7],[34,8,35,8],[34,10,35,10],[30,26,31,26],[30,27,31,27],[32,0,33,0],[32,1,33,1],[32,2,33,2],[32,3,33,3],[32,4,33,4],[32,6,33,6],[32,7,33,7],[32,8,33,8],[32,10,33,10],[32,11,33,11],[32,12,33,12],[32,14,33,14],[32,15,33,15],[32,16,33,16],[32,18,33,18],[32,19,33,19],[32,20,33,20],[32,22,33,22],[32,23,33,23],[32,24,33,24],[32,26,33,26],[32,27,33,27],[28,23,29,23],[28,24,29,24],[28,26,29,26],[28,27,29,27],[30,0,31,0],[30,1,31,1],[30,2,31,2],[30,3,31,3],[30,4,31,4],[30,6,31,6],[30,7,31,7],[30,8,31,8],[30,10,31,10],[30,11,31,11],[30,12,31,12],[30,14,31,14],[30,15,31,15],[30,16,31,16],[30,18,31,18],[30,19,31,19],[30,20,31,20],[30,22,31,22],[30,23,31,23],[30,24,31,24],[28,11,29,11],[28,12,29,12],[28,14,29,14],[28,15,29,15],[28,16,29,16],[28,18,29,18],[28,19,29,19],[28,20,29,20],[28,22,29,22],[28,0,29,0],[28,1,29,1],[28,2,29,2],[28,3,29,3],[28,4,29,4],[28,6,29,6],[28,7,29,7],[28,8,29,8],[28,10,29,10],[12,8,13,8],[12,10,13,10],[12,11,13,11],[26,10,27,10],[26,11,27,11],[26,12,27,12],[26,14,27,14],[26,15,27,15],[26,16,27,16],[20,16,21,16],[26,0,27,0],[26,1,27,1],[26,2,27,2],[26,3,27,3],[26,4,27,4],[26,6,27,6],[26,7,27,7],[26,8,27,8],[20,0,21,0],[20,1,21,1],[20,2,21,2],[20,3,21,3],[24,0,25,0],[24,1,25,1],[24,2,25,2],[24,3,25,3],[24,4,25,4],[24,6,25,6],[20,4,21,4],[20,6,21,6],[20,7,21,7],[20,8,21,8],[24,24,25,24],[24,26,25,26],[26,26,27,26],[24,27,25,27],[24,12,25,12],[24,14,25,14],[24,15,25,15],[24,16,25,16],[24,18,25,18],[24,19,25,19],[26,27,27,27],[26,22,27,22],[26,23,27,23],[26,24,27,24],[24,20,25,20],[26,18,27,18],[26,19,27,19],[26,20,27,20],[22,22,23,22],[22,7,23,7],[22,8,23,8],[22,10,23,10],[22,11,23,11],[22,12,23,12],[22,14,23,14],[24,22,25,22],[24,23,25,23],[24,7,25,7],[24,8,25,8],[24,10,25,10],[24,11,25,11],[22,15,23,15],[22,16,23,16],[22,18,23,18],[22,19,23,19],[22,20,23,20],[18,26,19,26],[20,26,21,26],[20,27,21,27],[22,0,23,0],[22,1,23,1],[22,2,23,2],[22,3,23,3],[22,4,23,4],[22,6,23,6],[20,18,21,18],[20,19,21,19],[20,20,21,20],[20,22,21,22],[20,23,21,23],[20,24,21,24],[20,10,21,10],[20,11,21,11],[20,12,21,12],[20,14,21,14],[20,15,21,15],[22,23,23,23],[22,24,23,24],[22,26,23,26],[22,27,23,27],[18,20,19,20],[18,22,19,22],[18,23,19,23],[18,24,19,24],[18,16,19,16],[18,18,19,18],[18,19,19,19],[18,4,19,4],[18,6,19,6],[18,7,19,7],[18,8,19,8],[18,10,19,10],[18,11,19,11],[16,23,17,23],[16,24,17,24],[16,26,17,26],[16,27,17,27],[18,0,19,0],[18,1,19,1],[18,2,19,2],[18,3,19,3],[16,15,17,15],[16,16,17,16],[16,18,17,18],[16,19,17,19],[16,20,17,20],[16,22,17,22],[16,7,17,7],[16,8,17,8],[16,10,17,10],[16,11,17,11],[16,12,17,12],[16,14,17,14],[18,27,19,27],[18,12,19,12],[18,14,19,14],[18,15,19,15],[16,0,17,0],[16,1,17,1],[16,2,17,2],[16,3,17,3],[16,4,17,4],[16,6,17,6],[14,18,15,18],[14,19,15,19],[14,20,15,20],[14,10,15,10],[14,11,15,11],[14,12,15,12],[14,14,15,14],[14,15,15,15],[14,16,15,16],[14,0,15,0],[14,1,15,1],[14,2,15,2],[14,3,15,3],[14,4,15,4],[14,6,15,6],[14,7,15,7],[14,8,15,8],[12,22,13,22],[12,23,13,23],[12,24,13,24],[12,26,13,26],[14,26,15,26],[12,27,13,27],[12,12,13,12],[12,14,13,14],[12,15,13,15],[12,16,13,16],[12,18,13,18],[12,19,13,19],[14,27,15,27],[14,22,15,22],[14,23,15,23],[14,24,15,24],[12,0,13,0],[12,1,13,1],[12,2,13,2],[12,3,13,3],[10,14,11,14],[10,16,11,16],[10,18,11,18],[10,19,11,19],[10,20,11,20],[10,6,11,6],[10,7,11,7],[10,8,11,8],[10,10,11,10],[10,11,11,11],[10,12,11,12],[10,0,11,0],[10,1,11,1],[10,2,11,2],[10,3,11,3],[10,4,11,4],[12,20,13,20],[12,4,13,4],[12,6,13,6],[12,7,13,7],[10,23,11,23],[10,24,11,24],[10,26,11,26],[8,22,9,22],[8,23,9,23],[8,24,9,24],[8,26,9,26],[8,27,9,27],[8,14,9,14],[8,15,9,15],[8,16,9,16],[8,18,9,18],[8,19,9,19],[8,20,9,20],[10,27,11,27],[10,22,11,22],[10,15,11,15],[6,19,6,22],[6,23,6,26],[0,12,0,13],[2,0,2,1],[2,5,2,7],[2,12,2,13],[8,0,9,0],[8,1,9,1],[8,2,9,2],[8,3,9,3],[8,4,9,4],[6,3,6,6],[6,7,6,10],[6,11,6,14],[6,15,6,18],[8,6,9,6],[8,7,9,7],[8,8,9,8],[8,10,9,10],[8,11,9,11],[8,12,9,12],[4,14,4,16],[2,14,2,16],[0,14,0,16]]}
["Wettkampfbogen",null,null,null,null,null,null,null,null,null,null,null,"Datum:",null,{"$f":"'INFO Blatt'!B13","v":"2019-02-16"}]
[]
[null,null,null,null,null,null,null,null,null,null,null,null,"Ort:",null,{"$f":"'INFO Blatt'!B11","v":"Hehlen"}]
[]
[null,null,null,null,null,null,null,null,null,null,null,null,null,"Liga:",{"$f":"'INFO Blatt'!B7","v":"Einsteigerliga"}]
[]
["Name","Verein","Jg","Boden",null,null,null,"Pferd",null,null,null,"Ringe",null,null,null,"Sprung",null,null,null,"Barren",null,null,null,"Reck",null,null,null,"Ges."]
[null,null,null,"D-Note","Abzug OK","E- Abzug","Note","D-Note","Abzug OK","E- Abzug","Note","D-Note","Abzug OK","E-Abzug","Note","D-Note","Abzug OK","E-Abzug","Note","D-Note","Abzug OK","E-Abzug","Note","D-Note","Abzug OK","E-Abzug","Note"]
[{"$f":"'Wertungszettel M6'!A7","v":"frei 1"},{"$f":"Formeln!A10","v":"M6"},{"$f":"IF(A9<>\"\", VLOOKUP(A9,'Wertungszettel M6'!A$7:B$36,2,0),\"\")","v":0},null,null,null,{"$f":"IF(AND(F9>0,F10>0),IF(OR(F9>10,F9<0,F10>10,F10<0),\"Fehler\",IF(ABS(D9)-ABS(E9)-(F9+F10)/2+10>0,IF(D9<0,-(ABS(D9)-ABS(E9)-(F9+F10)/2+10),D9-ABS(E9)-(F9+F10)/2+10),0)),0)","v":0},null,null,null,{"$f":"IF(AND(J9>0,J10>0),IF(OR(J9>10,J9<0,J10>10,J10<0),\"Fehler\",IF(ABS(H9)-ABS(I9)-(J9+J10)/2+10>0,IF(H9<0,-(ABS(H9)-ABS(I9)-(J9+J10)/2+10),H9-ABS(I9)-(J9+J10)/2+10),0)),0)","v":0},null,null,null,{"$f":"IF(AND(N9>0,N10>0),IF(OR(N9>10,N9<0,N10>10,N10<0),\"Fehler\",IF(ABS(L9)-ABS(M9)-(N9+N10)/2+10>0,IF(L9<0,-(ABS(L9)-ABS(M9)-(N9+N10)/2+10),L9-ABS(M9)-(N9+N10)/2+10),0)),0)","v":0},null,null,null,{"$f":"IF(AND(R9>0,R10>0),IF(OR(R9>10,R9<0,R10>10,R10<0),\"Fehler\",IF(ABS(P9)-ABS(Q9)-(R9+R10)/2+10>0,IF(P9<0,-(ABS(P9)-ABS(Q9)-(R9+R10)/2+10),P9-ABS(Q9)-(R9+R10)/2+10),0)),0)","v":0},null,null,null,{"$f":"IF(AND(V9>0,V10>0),IF(OR(V9>10,V9<0,V10>10,V10<0),\"Fehler\",IF(ABS(T9)-ABS(U9)-(V9+V10)/2+10>0,IF(T9<0,-(ABS(T9)-ABS(U9)-(V9+V10)/2+10),T9-ABS(U9)-(V9+V10)/2+10),0)),0)","v":0},null,null,null,{"$f":"IF(AND(Z9>0,Z10>0),IF(OR(Z9>10,Z9<0,Z10>10,Z10<0),\"Fehler\",IF(ABS(X9)-ABS(Y9)-(Z9+Z10)/2+10>0,IF(X9<0,-(ABS(X9)-ABS(Y9)-(Z9+Z10)/2+10),X9-ABS(Y9)-(Z9+Z10)/2+10),0)),0)","v":0},{"$f":"ABS(G9)+ABS(K9)+ABS(O9)+ABS(S9)+ABS(W9)+ABS(AA9)","v":0}]
[]
[{"$f":"'Wertungszettel M6'!A9","v":"frei 2"},{"$f":"IF(A11>0,B9,\"\")","v":"M6"},{"$f":"IF(A11<>\"\", VLOOKUP(A11,'Wertungszettel M6'!A$7:B$36,2,0),\"\")","v":0},null,null,null,{"$f":"IF(AND(F11>0,F12>0),IF(OR(F11>10,F11<0,F12>10,F12<0),\"Fehler\",IF(ABS(D11)-ABS(E11)-(F11+F12)/2+10>0,IF(D11<0,-(ABS(D11)-ABS(E11)-(F11+F12)/2+10),D11-ABS(E11)-(F11+F12)/2+10),0)),0)","v":0},null,null,null,{"$f":"IF(AND(J11>0,J12>0),IF(OR(J11>10,J11<0,J12>10,J12<0),\"Fehler\",IF(ABS(H11)-ABS(I11)-(J11+J12)/2+10>0,IF(H11<0,-(ABS(H11)-ABS(I11)-(J11+J12)/2+10),H11-ABS(I11)-(J11+J12)/2+10),0)),0)","v":0},null,null,null,{"$f":"IF(AND(N11>0,N12>0),IF(OR(N11>10,N11<0,N12>10,N12<0),\"Fehler\",IF(ABS(L11)-ABS(M11)-(N11+N12)/2+10>0,IF(L11<0,-(ABS(L11)-ABS(M11)-(N11+N12)/2+10),L11-ABS(M11)-(N11+N12)/2+10),0)),0)","v":0},null,null,null,{"$f":"IF(AND(R11>0,R12>0),IF(OR(R11>10,R11<0,R12>10,R12<0),\"Fehler\",IF(ABS(P11)-ABS(Q11)-(R11+R12)/2+10>0,IF(P11<0,-(ABS(P11)-ABS(Q11)-(R11+R12)/2+10),P11-ABS(Q11)-(R11+R12)/2+10),0)),0)","v":0},null,null,null,{"$f":"IF(AND(V11>0,V12>0),IF(OR(V11>10,V11<0,V12>10,V12<0),\"Fehler\",IF(ABS(T11)-ABS(U11)-(V11+V12)/2+10>0,IF(T11<0,-(ABS(T11)-ABS(U11)-(V11+V12)/2+10),T11-ABS(U11)-(V11+V12)/2+10),0)),0)","v":0},null,null,null,{"$f":"IF(AND(Z11>0,Z12>0),IF(OR(Z11>10,Z11<0,Z12>10,Z12<0),\"Fehler\",IF(ABS(X11)-ABS(Y11)-(Z11+Z12)/2+10>0,IF(X11<0,-(ABS(X11)-ABS(Y11)-(Z11+Z12)/2+10),X11-ABS(Y11)-(Z11+Z12)/2+10),0)),0)","v":0},{"$f":"ABS(G11)+ABS(K11)+ABS(O11)+ABS(S11)+ABS(W11)+ABS(AA11)","v":0},null,null,null,"Boden",{"$f":"IF(G40>1,1,0)","v":0}]
[null,null,null,null,null,null,null,null,null,null,null,null,null,null,null,null,null,null,null,null,null,null,null,null,null,null,null,null,null,null,null,"pauschenpferd",{"$f":"IF(K40>1,1,0)","v":0}]
[{"$f":"'Wertungszettel M6'!A11","v":"frei 3"},{"$f":"IF(A13>0,B11,\"\")","v":"M6"},{"$f":"IF(A13<>\"\", VLOOKUP(A13,'Wertungszettel M6'!A$7:B$36,2,0),\"\")","v":0},null,null,null,{"$f":"IF(AND(F13>0,F14>0),IF(OR(F13>10,F13<0,F14>10,F14<0),\"Fehler\",IF(ABS(D13)-ABS(E13)-(F13+F14)/2+10>0,IF(D13<0,-(ABS(D13)-ABS(E13)-(F13+F14)/2+10),D13-ABS(E13)-(F13+F14)/2+10),0)),0)","v":0},null,null,null,{"$f":"IF(AND(J13>0,J14>0),IF(OR(J13>10,J13<0,J14>10,J14<0),\"Fehler\",IF(ABS(H13)-ABS(I13)-(J13+J14)/2+10>0,IF(H13<0,-(ABS(H13)-ABS(I13)-(J13+J14)/2+10),H13-ABS(I13)-(J13+J14)/2+10),0)),0)","v":0},null,null,null,{"$f":"IF(AND(N13>0,N14>0),IF(OR(N13>10,N13<0,N14>10,N14<0),\"Fehler\",IF(ABS(L13)-ABS(M13)-(N13+N14)/2+10>0,IF(L13<0,-(ABS(L13)-ABS(M13)-(N13+N14)/2+10),L13-ABS(M13)-(N13+N14)/2+10),0)),0)","v":0},null,null,null,{"$f":"IF(AND(R13>0,R14>0),IF(OR(R13>10,R13<0,R14>10,R14<0),\"Fehler\",IF(ABS(P13)-ABS(Q13)-(R13+R14)/2+10>0,IF(P13<0,-(ABS(P13)-ABS(Q13)-(R13+R14)/2+10),P13-ABS(Q13)-(R13+R14)/2+10),0)),0)","v":0},null,null,null,{"$f":"IF(AND(V13>0,V14>0),IF(OR(V13>10,V13<0,V14>10,V14<0),\"Fehler\",IF(ABS(T13)-ABS(U13)-(V13+V14)/2+10>0,IF(T13<0,-(ABS(T13)-ABS(U13)-(V13+V14)/2+10),T13-ABS(U13)-(V13+V14)/2+10),0)),0)","v":0},null,null,null,{"$f":"IF(AND(Z13>0,Z14>0),IF(OR(Z13>10,Z13<0,Z14>10,Z14<0),\"Fehler\",IF(ABS(X13)-ABS(Y13)-(Z13+Z14)/2+10>0,IF(X13<0,-(ABS(X13)-ABS(Y13)-(Z13+Z14)/2+10),X13-ABS(Y13)-(Z13+Z14)/2+10),0)),0)","v":0},{"$f":"ABS(G13)+ABS(K13)+ABS(O13)+ABS(S13)+ABS(W13)+ABS(AA13)","v":0},null,null,null,"ringe",{"$f":"IF(O40>1,1,0)","v":0}]
[null,null,null,null,null,null,null,null,null,null,null,null,null,null,null,null,null,null,null,null,null,null,null,null,null,null,null,null,null,null,null,"sprung",{"$f":"IF(S40>1,1,0)","v":0}]
[{"$f":"'Wertungszettel M6'!A13","v":"frei 4"},{"$f":"IF(A15>0,B13,\"\")","v":"M6"},{"$f":"IF(A15<>\"\", VLOOKUP(A15,'Wertungszettel M6'!A$7:B$36,2,0),\"\")","v":0},null,null,null,{"$f":"IF(AND(F15>0,F16>0),IF(OR(F15>10,F15<0,F16>10,F16<0),\"Fehler\",IF(ABS(D15)-ABS(E15)-(F15+F16)/2+10>0,IF(D15<0,-(ABS(D15)-ABS(E15)-(F15+F16)/2+10),D15-ABS(E15)-(F15+F16)/2+10),0)),0)","v":0},null,null,null,{"$f":"IF(AND(J15>0,J16>0),IF(OR(J15>10,J15<0,J16>10,J16<0),\"Fehler\",IF(ABS(H15)-ABS(I15)-(J15+J16)/2+10>0,IF(H15<0,-(ABS(H15)-ABS(I15)-(J15+J16)/2+10),H15-ABS(I15)-(J15+J16)/2+10),0)),0)","v":0},null,null,null,{"$f":"IF(AND(N15>0,N16>0),IF(OR(N15>10,N15<0,N16>10,N16<0),\"Fehler\",IF(ABS(L15)-ABS(M15)-(N15+N16)/2+10>0,IF(L15<0,-(ABS(L15)-ABS(M15)-(N15+N16)/2+10),L15-ABS(M15)-(N15+N16)/2+10),0)),0)","v":0},null,null,null,{"$f":"IF(AND(R15>0,R16>0),IF(OR(R15>10,R15<0,R16>10,R16<0),\"Fehler\",IF(ABS(P15)-ABS(Q15)-(R15+R16)/2+10>0,IF(P15<0,-(ABS(P15)-ABS(Q15)-(R15+R16)/2+10),P15-ABS(Q15)-(R15+R16)/2+10),0)),0)","v":0},null,null,null,{"$f":"IF(AND(V15>0,V16>0),IF(OR(V15>10,V15<0,V16>10,V16<0),\"Fehler\",IF(ABS(T15)-ABS(U15)-(V15+V16)/2+10>0,IF(T15<0,-(ABS(T15)-ABS(U15)-(V15+V16)/2+10),T15-ABS(U15)-(V15+V16)/2+10),0)),0)","v":0},null,null,null,{"$f":"IF(AND(Z15>0,Z16>0),IF(OR(Z15>10,Z15<0,Z16>10,Z16<0),\"Fehler\",IF(ABS(X15)-ABS(Y15)-(Z15+Z16)/2+10>0,IF(X15<0,-(ABS(X15)-ABS(Y15)-(Z15+Z16)/2+10),X15-ABS(Y15)-(Z15+Z16)/2+10),0)),0)","v":0},{"$f":"ABS(G15)+ABS(K15)+ABS(O15)+ABS(S15)+ABS(W15)+ABS(AA15)","v":0},null,null,null,"Barren",{"$f":"IF(W40>1,1,0)","v":0}]
[null,null,null,null,null,null,null,null,null,null,null,null,null,null,null,null,null,null,null,null,null,null,null,null,null,null,null,null,null,null,null,"Reck",{"$f":"IF(AA40>1,1,0)","v":0}]
[{"$f":"'Wertungszettel M6'!A15","v":"frei 5"},{"$f":"IF(A17>0,B15,\"\")","v":"M6"},{"$f":"IF(A17<>\"\", VLOOKUP(A17,'Wertungszettel M6'!A$7:B$36,2,0),\"\")","v":0},null,null,null,{"$f":"IF(AND(F17>0,F18>0),IF(OR(F17>10,F17<0,F18>10,F18<0),\"Fehler\",IF(ABS(D17)-ABS(E17)-(F17+F18)/2+10>0,IF(D17<0,-(ABS(D17)-ABS(E17)-(F17+F18)/2+10),D17-ABS(E17)-(F17+F18)/2+10),0)),0)","v":0},null,null,null,{"$f":"IF(AND(J17>0,J18>0),IF(OR(J17>10,J17<0,J18>10,J18<0),\"Fehler\",IF(ABS(H17)-ABS(I17)-(J17+J18)/2+10>0,IF(H17<0,-(ABS(H17)-ABS(I17)-(J17+J18)/2+10),H17-ABS(I17)-(J17+J18)/2+10),0)),0)","v":0},null,null,null,{"$f":"IF(AND(N17>0,N18>0),IF(OR(N17>10,N17<0,N18>10,N18<0),\"Fehler\",IF(ABS(L17)-ABS(M17)-(N17+N18)/2+10>0,IF(L17<0,-(ABS(L17)-ABS(M17)-(N17+N18)/2+10),L17-ABS(M17)-(N17+N18)/2+10),0)),0)","v":0},null,null,null,{"$f":"IF(AND(R17>0,R18>0),IF(OR(R17>10,R17<0,R18>10,R18<0),\"Fehler\",IF(ABS(P17)-ABS(Q17)-(R17+R18)/2+10>0,IF(P17<0,-(ABS(P17)-ABS(Q17)-(R17+R18)/2+10),P17-ABS(Q17)-(R17+R18)/2+10),0)),0)","v":0},null,null,null,{"$f":"IF(AND(V17>0,V18>0),IF(OR(V17>10,V17<0,V18>10,V18<0),\"Fehler\",IF(ABS(T17)-ABS(U17)-(V17+V18)/2+10>0,IF(T17<0,-(ABS(T17)-ABS(U17)-(V17+V18)/2+10),T17-ABS(U17)-(V17+V18)/2+10),0)),0)","v":0},null,null,null,{"$f":"IF(AND(Z17>0,Z18>0),IF(OR(Z17>10,Z17<0,Z18>10,Z18<0),\"Fehler\",IF(ABS(X17)-ABS(Y17)-(Z17+Z18)/2+10>0,IF(X17<0,-(ABS(X17)-ABS(Y17)-(Z17+Z18)/2+10),X17-ABS(Y17)-(Z17+Z18)/2+10),0)),0)","v":0},{"$f":"ABS(G17)+ABS(K17)+ABS(O17)+ABS(S17)+ABS(W17)+ABS(AA17)","v":0}]
[null,null,null,null,null,null,null,null,null,null,null,null,null,null,null,null,null,null,null,null,null,null,null,null,null,null,null,null,null,null,null,"Gesamt",{"$f":"SUM(AG11:AG17)","v":0}]
[{"$f":"'Wertungszettel M6'!A17","v":"frei 6"},{"$f":"IF(A19>0,B17,\"\")","v":"M6"},{"$f":"IF(A19<>\"\", VLOOKUP(A19,'Wertungszettel M6'!A$7:B$36,2,0),\"\")","v":0},null,null,null,{"$f":"IF(AND(F19>0,F20>0),IF(OR(F19>10,F19<0,F20>10,F20<0),\"Fehler\",IF(ABS(D19)-ABS(E19)-(F19+F20)/2+10>0,IF(D19<0,-(ABS(D19)-ABS(E19)-(F19+F20)/2+10),D19-ABS(E19)-(F19+F20)/2+10),0)),0)","v":0},null,null,null,{"$f":"IF(AND(J19>0,J20>0),IF(OR(J19>10,J19<0,J20>10,J20<0),\"Fehler\",IF(ABS(H19)-ABS(I19)-(J19+J20)/2+10>0,IF(H19<0,-(ABS(H19)-ABS(I19)-(J19+J20)/2+10),H19-ABS(I19)-(J19+J20)/2+10),0)),0)","v":0},null,null,null,{"$f":"IF(AND(N19>0,N20>0),IF(OR(N19>10,N19<0,N20>10,N20<0),\"Fehler\",IF(ABS(L19)-ABS(M19)-(N19+N20)/2+10>0,IF(L19<0,-(ABS(L19)-ABS(M19)-(N19+N20)/2+10),L19-ABS(M19)-(N19+N20)/2+10),0)),0)","v":0},null,null,null,{"$f":"IF(AND(R19>0,R20>0),IF(OR(R19>10,R19<0,R20>10,R20<0),\"Fehler\",IF(ABS(P19)-ABS(Q19)-(R19+R20)/2+10>0,IF(P19<0,-(ABS(P19)-ABS(Q19)-(R19+R20)/2+10),P19-ABS(Q19)-(R19+R20)/2+10),0)),0)","v":0},null,null,null,{"$f":"IF(AND(V19>0,V20>0),IF(OR(V19>10,V19<0,V20>10,V20<0),\"Fehler\",IF(ABS(T19)-ABS(U19)-(V19+V20)/2+10>0,IF(T19<0,-(ABS(T19)-ABS(U19)-(V19+V20)/2+10),T19-ABS(U19)-(V19+V20)/2+10),0)),0)","v":0},null,null,null,{"$f":"IF(AND(Z19>0,Z20>0),IF(OR(Z19>10,Z19<0,Z20>10,Z20<0),\"Fehler\",IF(ABS(X19)-ABS(Y19)-(Z19+Z20)/2+10>0,IF(X19<0,-(ABS(X19)-ABS(Y19)-(Z19+Z20)/2+10),X19-ABS(Y19)-(Z19+Z20)/2+10),0)),0)","v":0},{"$f":"ABS(G19)+ABS(K19)+ABS(O19)+ABS(S19)+ABS(W19)+ABS(AA19)","v":0}]
[]
[{"$f":"'Wertungszettel M6'!A19","v":"frei 7"},{"$f":"IF(A21>0,B19,\"\")","v":"M6"},{"$f":"IF(A21<>\"\", VLOOKUP(A21,'Wertungszettel M6'!A$7:B$36,2,0),\"\")","v":0},null,null,null,{"$f":"IF(AND(F21>0,F22>0),IF(OR(F21>10,F21<0,F22>10,F22<0),\"Fehler\",IF(ABS(D21)-ABS(E21)-(F21+F22)/2+10>0,IF(D21<0,-(ABS(D21)-ABS(E21)-(F21+F22)/2+10),D21-ABS(E21)-(F21+F22)/2+10),0)),0)","v":0},null,null,null,{"$f":"IF(AND(J21>0,J22>0),IF(OR(J21>10,J21<0,J22>10,J22<0),\"Fehler\",IF(ABS(H21)-ABS(I21)-(J21+J22)/2+10>0,IF(H21<0,-(ABS(H21)-ABS(I21)-(J21+J22)/2+10),H21-ABS(I21)-(J21+J22)/2+10),0)),0)","v":0},null,null,null,{"$f":"IF(AND(N21>0,N22>0),IF(OR(N21>10,N21<0,N22>10,N22<0),\"Fehler\",IF(ABS(L21)-ABS(M21)-(N21+N22)/2+10>0,IF(L21<0,-(ABS(L21)-ABS(M21)-(N21+N22)/2+10),L21-ABS(M21)-(N21+N22)/2+10),0)),0)","v":0},null,null,null,{"$f":"IF(AND(R21>0,R22>0),IF(OR(R21>10,R21<0,R22>10,R22<0),\"Fehler\",IF(ABS(P21)-ABS(Q21)-(R21+R22)/2+10>0,IF(P21<0,-(ABS(P21)-ABS(Q21)-(R21+R22)/2+10),P21-ABS(Q21)-(R21+R22)/2+10),0)),0)","v":0},null,null,null,{"$f":"IF(AND(V21>0,V22>0),IF(OR(V21>10,V21<0,V22>10,V22<0),\"Fehler\",IF(ABS(T21)-ABS(U21)-(V21+V22)/2+10>0,IF(T21<0,-(ABS(T21)-ABS(U21)-(V21+V22)/2+10),T21-ABS(U21)-(V21+V22)/2+10),0)),0)","v":0},null,null,null,{"$f":"IF(AND(Z21>0,Z22>0),IF(OR(Z21>10,Z21<0,Z22>10,Z22<0),\"Fehler\",IF(ABS(X21)-ABS(Y21)-(Z21+Z22)/2+10>0,IF(X21<0,-(ABS(X21)-ABS(Y21)-(Z21+Z22)/2+10),X21-ABS(Y21)-(Z21+Z22)/2+10),0)),0)","v":0},{"$f":"ABS(G21)+ABS(K21)+ABS(O21)+ABS(S21)+ABS(W21)+ABS(AA21)","v":0}]
[]
[{"$f":"'Wertungszettel M6'!A21","v":"frei 8"},{"$f":"IF(A23>0,B21,\"\")","v":"M6"},{"$f":"IF(A23<>\"\", VLOOKUP(A23,'Wertungszettel M6'!A$7:B$36,2,0),\"\")","v":0},null,null,null,{"$f":"IF(AND(F23>0,F24>0),IF(OR(F23>10,F23<0,F24>10,F24<0),\"Fehler\",IF(ABS(D23)-ABS(E23)-(F23+F24)/2+10>0,IF(D23<0,-(ABS(D23)-ABS(E23)-(F23+F24)/2+10),D23-ABS(E23)-(F23+F24)/2+10),0)),0)","v":0},null,null,null,{"$f":"IF(AND(J23>0,J24>0),IF(OR(J23>10,J23<0,J24>10,J24<0),\"Fehler\",IF(ABS(H23)-ABS(I23)-(J23+J24)/2+10>0,IF(H23<0,-(ABS(H23)-ABS(I23)-(J23+J24)/2+10),H23-ABS(I23)-(J23+J24)/2+10),0)),0)","v":0},null,null,null,{"$f":"IF(AND(N23>0,N24>0),IF(OR(N23>10,N23<0,N24>10,N24<0),\"Fehler\",IF(ABS(L23)-ABS(M23)-(N23+N24)/2+10>0,IF(L23<0,-(ABS(L23)-ABS(M23)-(N23+N24)/2+10),L23-ABS(M23)-(N23+N24)/2+10),0)),0)","v":0},null,null,null,{"$f":"IF(AND(R23>0,R24>0),IF(OR(R23>10,R23<0,R24>10,R24<0),\"Fehler\",IF(ABS(P23)-ABS(Q23)-(R23+R24)/2+10>0,IF(P23<0,-(ABS(P23)-ABS(Q23)-(R23+R24)/2+10),P23-ABS(Q23)-(R23+R24)/2+10),0)),0)","v":0},null,null,null,{"$f":"IF(AND(V23>0,V24>0),IF(OR(V23>10,V23<0,V24>10,V24<0),\"Fehler\",IF(ABS(T23)-ABS(U23)-(V23+V24)/2+10>0,IF(T23<0,-(ABS(T23)-ABS(U23)-(V23+V24)/2+10),T23-ABS(U23)-(V23+V24)/2+10),0)),0)","v":0},null,null,null,{"$f":"IF(AND(Z23>0,Z24>0),IF(OR(Z23>10,Z23<0,Z24>10,Z24<0),\"Fehler\",IF(ABS(X23)-ABS(Y23)-(Z23+Z24)/2+10>0,IF(X23<0,-(ABS(X23)-ABS(Y23)-(Z23+Z24)/2+10),X23-ABS(Y23)-(Z23+Z24)/2+10),0)),0)","v":0},{"$f":"ABS(G23)+ABS(K23)+ABS(O23)+ABS(S23)+ABS(W23)+ABS(AA23)","v":0}]
[]
[{"$f":"'Wertungszettel M6'!A23","v":"frei 9"},{"$f":"IF(A25>0,B23,\"\")","v":"M6"},{"$f":"IF(A25<>\"\", VLOOKUP(A25,'Wertungszettel M6'!A$7:B$36,2,0),\"\")","v":0},null,null,null,{"$f":"IF(AND(F25>0,F26>0),IF(OR(F25>10,F25<0,F26>10,F26<0),\"Fehler\",IF(ABS(D25)-ABS(E25)-(F25+F26)/2+10>0,IF(D25<0,-(ABS(D25)-ABS(E25)-(F25+F26)/2+10),D25-ABS(E25)-(F25+F26)/2+10),0)),0)","v":0},null,null,null,{"$f":"IF(AND(J25>0,J26>0),IF(OR(J25>10,J25<0,J26>10,J26<0),\"Fehler\",IF(ABS(H25)-ABS(I25)-(J25+J26)/2+10>0,IF(H25<0,-(ABS(H25)-ABS(I25)-(J25+J26)/2+10),H25-ABS(I25)-(J25+J26)/2+10),0)),0)","v":0},null,null,null,{"$f":"IF(AND(N25>0,N26>0),IF(OR(N25>10,N25<0,N26>10,N26<0),\"Fehler\",IF(ABS(L25)-ABS(M25)-(N25+N26)/2+10>0,IF(L25<0,-(ABS(L25)-ABS(M25)-(N25+N26)/2+10),L25-ABS(M25)-(N25+N26)/2+10),0)),0)","v":0},null,null,null,{"$f":"IF(AND(R25>0,R26>0),IF(OR(R25>10,R25<0,R26>10,R26<0),\"Fehler\",IF(ABS(P25)-ABS(Q25)-(R25+R26)/2+10>0,IF(P25<0,-(ABS(P25)-ABS(Q25)-(R25+R26)/2+10),P25-ABS(Q25)-(R25+R26)/2+10),0)),0)","v":0},null,null,null,{"$f":"IF(AND(V25>0,V26>0),IF(OR(V25>10,V25<0,V26>10,V26<0),\"Fehler\",IF(ABS(T25)-ABS(U25)-(V25+V26)/2+10>0,IF(T25<0,-(ABS(T25)-ABS(U25)-(V25+V26)/2+10),T25-ABS(U25)-(V25+V26)/2+10),0)),0)","v":0},null,null,null,{"$f":"IF(AND(Z25>0,Z26>0),IF(OR(Z25>10,Z25<0,Z26>10,Z26<0),\"Fehler\",IF(ABS(X25)-ABS(Y25)-(Z25+Z26)/2+10>0,IF(X25<0,-(ABS(X25)-ABS(Y25)-(Z25+Z26)/2+10),X25-ABS(Y25)-(Z25+Z26)/2+10),0)),0)","v":0},{"$f":"ABS(G25)+ABS(K25)+ABS(O25)+ABS(S25)+ABS(W25)+ABS(AA25)","v":0}]
[]
[{"$f":"'Wertungszettel M6'!A25","v":"frei 10"},{"$f":"IF(A27>0,B25,\"\")","v":"M6"},{"$f":"IF(A27<>\"\", VLOOKUP(A27,'Wertungszettel M6'!A$7:B$36,2,0),\"\")","v":0},null,null,null,{"$f":"IF(AND(F27>0,F28>0),IF(OR(F27>10,F27<0,F28>10,F28<0),\"Fehler\",IF(ABS(D27)-ABS(E27)-(F27+F28)/2+10>0,IF(D27<0,-(ABS(D27)-ABS(E27)-(F27+F28)/2+10),D27-ABS(E27)-(F27+F28)/2+10),0)),0)","v":0},null,null,null,{"$f":"IF(AND(J27>0,J28>0),IF(OR(J27>10,J27<0,J28>10,J28<0),\"Fehler\",IF(ABS(H27)-ABS(I27)-(J27+J28)/2+10>0,IF(H27<0,-(ABS(H27)-ABS(I27)-(J27+J28)/2+10),H27-ABS(I27)-(J27+J28)/2+10),0)),0)","v":0},null,null,null,{"$f":"IF(AND(N27>0,N28>0),IF(OR(N27>10,N27<0,N28>10,N28<0),\"Fehler\",IF(ABS(L27)-ABS(M27)-(N27+N28)/2+10>0,IF(L27<0,-(ABS(L27)-ABS(M27)-(N27+N28)/2+10),L27-ABS(M27)-(N27+N28)/2+10),0)),0)","v":0},null,null,null,{"$f":"IF(AND(R27>0,R28>0),IF(OR(R27>10,R27<0,R28>10,R28<0),\"Fehler\",IF(ABS(P27)-ABS(Q27)-(R27+R28)/2+10>0,IF(P27<0,-(ABS(P27)-ABS(Q27)-(R27+R28)/2+10),P27-ABS(Q27)-(R27+R28)/2+10),0)),0)","v":0},null,null,null,{"$f":"IF(AND(V27>0,V28>0),IF(OR(V27>10,V27<0,V28>10,V28<0),\"Fehler\",IF(ABS(T27)-ABS(U27)-(V27+V28)/2+10>0,IF(T27<0,-(ABS(T27)-ABS(U27)-(V27+V28)/2+10),T27-ABS(U27)-(V27+V28)/2+10),0)),0)","v":0},null,null,null,{"$f":"IF(AND(Z27>0,Z28>0),IF(OR(Z27>10,Z27<0,Z28>10,Z28<0),\"Fehler\",IF(ABS(X27)-ABS(Y27)-(Z27+Z28)/2+10>0,IF(X27<0,-(ABS(X27)-ABS(Y27)-(Z27+Z28)/2+10),X27-ABS(Y27)-(Z27+Z28)/2+10),0)),0)","v":0},{"$f":"ABS(G27)+ABS(K27)+ABS(O27)+ABS(S27)+ABS(W27)+ABS(AA27)","v":0}]
[]
[{"$f":"'Wertungszettel M6'!A27","v":"frei 11"},{"$f":"IF(A29>0,B27,\"\")","v":"M6"},{"$f":"IF(A29<>\"\", VLOOKUP(A29,'Wertungszettel M6'!A$7:B$36,2,0),\"\")","v":0},null,null,null,{"$f":"IF(AND(F29>0,F30>0),IF(OR(F29>10,F29<0,F30>10,F30<0),\"Fehler\",IF(ABS(D30)-ABS(E30)-(F29+F30)/2+10>0,IF(D30<0,-(ABS(D30)-ABS(E30)-(F29+F30)/2+10),D29-ABS(E29)-(F29+F30)/2+10),0)),0)","v":0},null,null,null,{"$f":"IF(AND(J29>0,J30>0),IF(OR(J29>10,J29<0,J30>10,J30<0),\"Fehler\",IF(ABS(H30)-ABS(I30)-(J29+J30)/2+10>0,IF(H30<0,-(ABS(H30)-ABS(I30)-(J29+J30)/2+10),H29-ABS(I29)-(J29+J30)/2+10),0)),0)","v":0},null,null,null,{"$f":"IF(AND(N29>0,N30>0),IF(OR(N29>10,N29<0,N30>10,N30<0),\"Fehler\",IF(ABS(L30)-ABS(M30)-(N29+N30)/2+10>0,IF(L30<0,-(ABS(L30)-ABS(M30)-(N29+N30)/2+10),L29-ABS(M29)-(N29+N30)/2+10),0)),0)","v":0},null,null,null,{"$f":"IF(AND(R29>0,R30>0),IF(OR(R29>10,R29<0,R30>10,R30<0),\"Fehler\",IF(ABS(P30)-ABS(Q30)-(R29+R30)/2+10>0,IF(P30<0,-(ABS(P30)-ABS(Q30)-(R29+R30)/2+10),P29-ABS(Q29)-(R29+R30)/2+10),0)),0)","v":0},null,null,null,{"$f":"IF(AND(V29>0,V30>0),IF(OR(V29>10,V29<0,V30>10,V30<0),\"Fehler\",IF(ABS(T30)-ABS(U30)-(V29+V30)/2+10>0,IF(T30<0,-(ABS(T30)-ABS(U30)-(V29+V30)/2+10),T29-ABS(U29)-(V29+V30)/2+10),0)),0)","v":0},null,null,null,{"$f":"IF(AND(Z29>0,Z30>0),IF(OR(Z29>10,Z29<0,Z30>10,Z30<0),\"Fehler\",IF(ABS(X30)-ABS(Y30)-(Z29+Z30)/2+10>0,IF(X30<0,-(ABS(X30)-ABS(Y30)-(Z29+Z30)/2+10),X29-ABS(Y29)-(Z29+Z30)/2+10),0)),0)","v":0},{"$f":"ABS(G29)+ABS(K29)+ABS(O29)+ABS(S29)+ABS(W29)+ABS(AA29)","v":0}]
[]
[{"$f":"'Wertungszettel M6'!A29","v":"frei 12"},{"$f":"IF(A31>0,B29,\"\")","v":"M6"},{"$f":"IF(A31<>\"\", VLOOKUP(A31,'Wertungszettel M6'!A$7:B$36,2,0),\"\")","v":0},null,null,null,{"$f":"IF(AND(F31>0,F32>0),IF(OR(F31>10,F31<0,F32>10,F32<0),\"Fehler\",IF(ABS(D32)-ABS(E32)-(F31+F32)/2+10>0,IF(D32<0,-(ABS(D32)-ABS(E32)-(F31+F32)/2+10),D31-ABS(E31)-(F31+F32)/2+10),0)),0)","v":0},null,null,null,{"$f":"IF(AND(J31>0,J32>0),IF(OR(J31>10,J31<0,J32>10,J32<0),\"Fehler\",IF(ABS(H32)-ABS(I32)-(J31+J32)/2+10>0,IF(H32<0,-(ABS(H32)-ABS(I32)-(J31+J32)/2+10),H31-ABS(I31)-(J31+J32)/2+10),0)),0)","v":0},null,null,null,{"$f":"IF(AND(N31>0,N32>0),IF(OR(N31>10,N31<0,N32>10,N32<0),\"Fehler\",IF(ABS(L32)-ABS(M32)-(N31+N32)/2+10>0,IF(L32<0,-(ABS(L32)-ABS(M32)-(N31+N32)/2+10),L31-ABS(M31)-(N31+N32)/2+10),0)),0)","v":0},null,null,null,{"$f":"IF(AND(R31>0,R32>0),IF(OR(R31>10,R31<0,R32>10,R32<0),\"Fehler\",IF(ABS(P32)-ABS(Q32)-(R31+R32)/2+10>0,IF(P32<0,-(ABS(P32)-ABS(Q32)-(R31+R32)/2+10),P31-ABS(Q31)-(R31+R32)/2+10),0)),0)","v":0},null,null,null,{"$f":"IF(AND(V31>0,V32>0),IF(OR(V31>10,V31<0,V32>10,V32<0),\"Fehler\",IF(ABS(T32)-ABS(U32)-(V31+V32)/2+10>0,IF(T32<0,-(ABS(T32)-ABS(U32)-(V31+V32)/2+10),T31-ABS(U31)-(V31+V32)/2+10),0)),0)","v":0},null,null,null,{"$f":"IF(AND(Z31>0,Z32>0),IF(OR(Z31>10,Z31<0,Z32>10,Z32<0),\"Fehler\",IF(ABS(X32)-ABS(Y32)-(Z31+Z32)/2+10>0,IF(X32<0,-(ABS(X32)-ABS(Y32)-(Z31+Z32)/2+10),X31-ABS(Y31)-(Z31+Z32)/2+10),0)),0)","v":0},{"$f":"ABS(G31)+ABS(K31)+ABS(O31)+ABS(S31)+ABS(W31)+ABS(AA31)","v":0}]
[]
[{"$f":"'Wertungszettel M6'!A31","v":"frei 13"},{"$f":"IF(A33>0,B31,\"\")","v":"M6"},{"$f":"IF(A33<>\"\", VLOOKUP(A33,'Wertungszettel M6'!A$7:B$36,2,0),\"\")","v":0},null,null,null,{"$f":"IF(AND(F33>0,F34>0),IF(OR(F33>10,F33<0,F34>10,F34<0),\"Fehler\",IF(ABS(D34)-ABS(E34)-(F33+F34)/2+10>0,IF(D34<0,-(ABS(D34)-ABS(E34)-(F33+F34)/2+10),D33-ABS(E33)-(F33+F34)/2+10),0)),0)","v":0},null,null,null,{"$f":"IF(AND(J33>0,J34>0),IF(OR(J33>10,J33<0,J34>10,J34<0),\"Fehler\",IF(ABS(H34)-ABS(I34)-(J33+J34)/2+10>0,IF(H34<0,-(ABS(H34)-ABS(I34)-(J33+J34)/2+10),H33-ABS(I33)-(J33+J34)/2+10),0)),0)","v":0},null,null,null,{"$f":"IF(AND(N33>0,N34>0),IF(OR(N33>10,N33<0,N34>10,N34<0),\"Fehler\",IF(ABS(L34)-ABS(M34)-(N33+N34)/2+10>0,IF(L34<0,-(ABS(L34)-ABS(M34)-(N33+N34)/2+10),L33-ABS(M33)-(N33+N34)/2+10),0)),0)","v":0},null,null,null,{"$f":"IF(AND(R33>0,R34>0),IF(OR(R33>10,R33<0,R34>10,R34<0),\"Fehler\",IF(ABS(P34)-ABS(Q34)-(R33+R34)/2+10>0,IF(P34<0,-(ABS(P34)-ABS(Q34)-(R33+R34)/2+10),P33-ABS(Q33)-(R33+R34)/2+10),0)),0)","v":0},null,null,null,{"$f":"IF(AND(V33>0,V34>0),IF(OR(V33>10,V33<0,V34>10,V34<0),\"Fehler\",IF(ABS(T34)-ABS(U34)-(V33+V34)/2+10>0,IF(T34<0,-(ABS(T34)-ABS(U34)-(V33+V34)/2+10),T33-ABS(U33)-(V33+V34)/2+10),0)),0)","v":0},null,null,null,{"$f":"IF(AND(Z33>0,Z34>0),IF(OR(Z33>10,Z33<0,Z34>10,Z34<0),\"Fehler\",IF(ABS(X34)-ABS(Y34)-(Z33+Z34)/2+10>0,IF(X34<0,-(ABS(X34)-ABS(Y34)-(Z33+Z34)/2+10),X33-ABS(Y33)-(Z33+Z34)/2+10),0)),0)","v":0},{"$f":"ABS(G33)+ABS(K33)+ABS(O33)+ABS(S33)+ABS(W33)+ABS(AA33)","v":0}]
[]
[{"$f":"'Wertungszettel M6'!A33","v":"frei 14"},{"$f":"IF(A35>0,B33,\"\")","v":"M6"},{"$f":"IF(A35<>\"\", VLOOKUP(A35,'Wertungszettel M6'!A$7:B$36,2,0),\"\")","v":0},null,null,null,{"$f":"IF(AND(F35>0,F36>0),IF(OR(F35>10,F35<0,F36>10,F36<0),\"Fehler\",IF(ABS(D36)-ABS(E36)-(F35+F36)/2+10>0,IF(D36<0,-(ABS(D36)-ABS(E36)-(F35+F36)/2+10),D35-ABS(E35)-(F35+F36)/2+10),0)),0)","v":0},null,null,null,{"$f":"IF(AND(J35>0,J36>0),IF(OR(J35>10,J35<0,J36>10,J36<0),\"Fehler\",IF(ABS(H36)-ABS(I36)-(J35+J36)/2+10>0,IF(H36<0,-(ABS(H36)-ABS(I36)-(J35+J36)/2+10),H35-ABS(I35)-(J35+J36)/2+10),0)),0)","v":0},null,null,null,{"$f":"IF(AND(N35>0,N36>0),IF(OR(N35>10,N35<0,N36>10,N36<0),\"Fehler\",IF(ABS(L36)-ABS(M36)-(N35+N36)/2+10>0,IF(L36<0,-(ABS(L36)-ABS(M36)-(N35+N36)/2+10),L35-ABS(M35)-(N35+N36)/2+10),0)),0)","v":0},null,null,null,{"$f":"IF(AND(R35>0,R36>0),IF(OR(R35>10,R35<0,R36>10,R36<0),\"Fehler\",IF(ABS(P36)-ABS(Q36)-(R35+R36)/2+10>0,IF(P36<0,-(ABS(P36)-ABS(Q36)-(R35+R36)/2+10),P35-ABS(Q35)-(R35+R36)/2+10),0)),0)","v":0},null,null,null,{"$f":"IF(AND(V35>0,V36>0),IF(OR(V35>10,V35<0,V36>10,V36<0),\"Fehler\",IF(ABS(T36)-ABS(U36)-(V35+V36)/2+10>0,IF(T36<0,-(ABS(T36)-ABS(U36)-(V35+V36)/2+10),T35-ABS(U35)-(V35+V36)/2+10),0)),0)","v":0},null,null,null,{"$f":"IF(AND(Z35>0,Z36>0),IF(OR(Z35>10,Z35<0,Z36>10,Z36<0),\"Fehler\",IF(ABS(X36)-ABS(Y36)-(Z35+Z36)/2+10>0,IF(X36<0,-(ABS(X36)-ABS(Y36)-(Z35+Z36)/2+10),X35-ABS(Y35)-(Z35+Z36)/2+10),0)),0)","v":0},{"$f":"ABS(G35)+ABS(K35)+ABS(O35)+ABS(S35)+ABS(W35)+ABS(AA35)","v":0}]
[]
[{"$f":"'Wertungszettel M6'!A35","v":"frei 15"},{"$f":"IF(A37>0,B35,\"\")","v":"M6"},{"$f":"IF(A37<>\"\", VLOOKUP(A37,'Wertungszettel M6'!A$7:B$36,2,0),\"\")","v":0},null,null,null,{"$f":"IF(AND(F37>0,F38>0),IF(OR(F37>10,F37<0,F38>10,F38<0),\"Fehler\",IF(ABS(D38)-ABS(E38)-(F37+F38)/2+10>0,IF(D38<0,-(ABS(D38)-ABS(E38)-(F37+F38)/2+10),D37-ABS(E37)-(F37+F38)/2+10),0)),0)","v":0},null,null,null,{"$f":"IF(AND(J37>0,J38>0),IF(OR(J37>10,J37<0,J38>10,J38<0),\"Fehler\",IF(ABS(H38)-ABS(I38)-(J37+J38)/2+10>0,IF(H38<0,-(ABS(H38)-ABS(I38)-(J37+J38)/2+10),H37-ABS(I37)-(J37+J38)/2+10),0)),0)","v":0},null,null,null,{"$f":"IF(AND(N37>0,N38>0),IF(OR(N37>10,N37<0,N38>10,N38<0),\"Fehler\",IF(ABS(L38)-ABS(M38)-(N37+N38)/2+10>0,IF(L38<0,-(ABS(L38)-ABS(M38)-(N37+N38)/2+10),L37-ABS(M37)-(N37+N38)/2+10),0)),0)","v":0},null,null,null,{"$f":"IF(AND(R37>0,R38>0),IF(OR(R37>10,R37<0,R38>10,R38<0),\"Fehler\",IF(ABS(P38)-ABS(Q38)-(R37+R38)/2+10>0,IF(P38<0,-(ABS(P38)-ABS(Q38)-(R37+R38)/2+10),P37-ABS(Q37)-(R37+R38)/2+10),0)),0)","v":0},null,null,null,{"$f":"IF(AND(V37>0,V38>0),IF(OR(V37>10,V37<0,V38>10,V38<0),\"Fehler\",IF(ABS(T38)-ABS(U38)-(V37+V38)/2+10>0,IF(T38<0,-(ABS(T38)-ABS(U38)-(V37+V38)/2+10),T37-ABS(U37)-(V37+V38)/2+10),0)),0)","v":0},null,null,null,{"$f":"IF(AND(Z37>0,Z38>0),IF(OR(Z37>10,Z37<0,Z38>10,Z38<0),\"Fehler\",IF(ABS(X38)-ABS(Y38)-(Z37+Z38)/2+10>0,IF(X38<0,-(ABS(X38)-ABS(Y38)-(Z37+Z38)/2+10),X37-ABS(Y37)-(Z37+Z38)/2+10),0)),0)","v":0},{"$f":"ABS(G37)+ABS(K37)+ABS(O37)+ABS(S37)+ABS(W37)+ABS(AA37)","v":0}]
[]
[]
[null,null,null,null,null,null,{"$f":"SUM(LARGE(G9:G38,1),LARGE(G9:G38,2),LARGE(G9:G38,3))","v":0},null,null,null,{"$f":"SUM(LARGE(K9:K38,1),LARGE(K9:K38,2),LARGE(K9:K38,3))","v":0},null,null,null,{"$f":"SUM(LARGE(O9:O38,1),LARGE(O9:O38,2),LARGE(O9:O38,3))","v":0},null,null,null,{"$f":"SUM(LARGE(S9:S38,1),LARGE(S9:S38,2),LARGE(S9:S38,3))","v":0},null,null,null,{"$f":"SUM(LARGE(W9:W38,1),LARGE(W9:W38,2),LARGE(W9:W38,3))","v":0},null,null,null,{"$f":"SUM(LARGE(AA9:AA38,1),LARGE(AA9:AA38,2),LARGE(AA9:AA38,3))","v":0},{"$f":"SUM(G40,K40,O40,S40,W40,AA40)","v":0}]

{"sheet":"M7","index":10,"n_rows":30,"n_cols":33,"rows_kept":30,"cut":false,"hidden":true,"merged":[[6,23,6,26],[0,12,0,13],[2,0,2,1],[2,5,2,7],[2,12,2,13],[8,2,9,2],[8,3,9,3],[8,4,9,4],[8,6,9,6],[6,3,6,6],[6,7,6,10],[6,11,6,14],[6,15,6,18],[6,19,6,22],[8,23,9,23],[8,24,9,24],[8,26,9,26],[8,22,9,22],[2,14,2,16],[0,14,0,16],[4,14,4,16],[8,27,9,27],[10,0,11,0],[10,1,11,1],[10,2,11,2],[10,3,11,3],[10,4,11,4],[10,6,11,6],[8,15,9,15],[8,16,9,16],[8,18,9,18],[8,19,9,19],[8,20,9,20],[10,23,11,23],[8,7,9,7],[8,8,9,8],[8,10,9,10],[8,11,9,11],[8,12,9,12],[8,14,9,14],[8,0,9,0],[8,1,9,1],[10,24,11,24],[10,26,11,26],[10,27,11,27],[12,0,13,0],[12,1,13,1],[12,2,13,2],[12,3,13,3],[12,4,13,4],[12,6,13,6],[12,7,13,7],[10,16,11,16],[10,18,11,18],[10,15,11,15],[10,19,11,19],[10,20,11,20],[10,22,11,22],[10,7,11,7],[10,8,11,8],[10,10,11,10],[10,11,11,11],[10,12,11,12],[10,14,11,14],[12,24,13,24],[12,26,13,26],[12,27,13,27],[14,0,15,0],[14,1,15,1],[14,2,15,2],[14,3,15,3],[14,4,15,4],[14,6,15,6],[14,7,15,7],[12,16,13,16],[12,18,13,18],[12,19,13,19],[12,20,13,20],[12,22,13,22],[12,23,13,23],[12,8,13,8],[12,10,13,10],[12,11,13,11],[12,12,13,12],[12,14,13,14],[12,15,13,15],[14,24,15,24],[14,26,15,26],[14,27,15,27],[16,0,17,0],[16,1,17,1],[16,2,17,2],[16,3,17,3],[16,4,17,4],[16,6,17,6],[16,7,17,7],[14,16,15,16],[14,18,15,18],[14,19,15,19],[14,20,15,20],[14,22,15,22],[14,23,15,23],[14,8,15,8],[14,10,15,10],[14,11,15,11],[14,12,15,12],[14,14,15,14],[14,15,15,15],[16,24,17,24],[16,26,17,26],[16,27,17,27],[16,19,17,19],[18,0,19,0],[18,1,19,1],[18,2,19,2],[18,3,19,3],[18,4,19,4],[18,6,19,6],[18,7,19,7],[16,16,17,16],[16,18,17,18],[16,20,17,20],[16,22,17,22],[16,23,17,23],[16,8,17,8],[16,10,17,10],[16,11,17,11],[16,12,17,12],[16,14,17,14],[16,15,17,15],[18,24,19,24],[18,26,19,26],[18,27,19,27],[20,0,21,0],[20,1,21,1],[20,2,21,2],[20,3,21,3],[20,4,21,4],[20,6,21,6],[20,7,21,7],[18,16,19,16],[18,18,19,18],[18,19,19,19],[18,20,19,20],[18,22,19,22],[18,23,19,23],[18,8,19,8],[18,10,19,10],[18,11,19,11],[18,12,19,12],[18,14,19,14],[18,15,19,15],[20,24,21,24],[20,26,21,26],[20,27,21,27],[22,0,23,0],[22,1,23,1],[22,2,23,2],[22,3,23,3],[22,4,23,4],[22,6,23,6],[22,7,23,7],[20,16,21,16],[20,18,21,18],[20,19,21,19],[20,20,21,20],[20,22,21,22],[20,23,21,23],[20,8,21,8],[20,10,21,10],[20,11,21,11],[20,12,21,12],[20,14,21,14],[20,15,21,15],[22,24,23,24],[22,26,23,26],[22,27,23,27],[22,19,23,19],[24,0,25,0],[24,1,25,1],[24,2,25,2],[24,3,25,3],[24,4,25,4],[24,6,25,6],[24,7,25,7],[22,16,23,16],[22,18,23,18],[22,20,23,20],[22,22,23,22],[22,23,23,23],[22,8,23,8],[22,10,23,10],[22,11,23,11],[22,12,23,12],[22,14,23,14],[22,15,23,15],[24,24,25,24],[24,26,25,26],[24,27,25,27],[26,0,27,0],[26,1,27,1],[26,2,27,2],[26,3,27,3],[26,4,27,4],[26,6,27,6],[26,7,27,7],[24,16,25,16],[24,18,25,18],[24,19,25,19],[24,20,25,20],[24,22,25,22],[24,23,25,23],[24,8,25,8],[24,10,25,10],[24,11,25,11],[24,12,25,12],[24,14,25,14],[24,15,25,15],[26,24,27,24],[26,26,27,26],[26,27,27,27],[26,16,27,16],[26,18,27,18],[26,19,27,19],[26,20,27,20],[26,22,27,22],[26,23,27,23],[26,8,27,8],[26,10,27,10],[26,11,27,11],[26,12,27,12],[26,14,27,14],[26,15,27,15]]}
["Wettkampfbogen",null,null,null,null,null,null,null,null,null,null,null,"Datum:",null,{"$f":"'INFO Blatt'!B13","v":"2019-02-16"}]
[]
[null,null,null,null,null,null,null,null,null,null,null,null,"Ort:",null,{"$f":"'INFO Blatt'!B11","v":"Hehlen"}]
[]
[null,null,null,null,null,null,null,null,null,null,null,null,null,"Liga:",{"$f":"'INFO Blatt'!B7","v":"Einsteigerliga"}]
[]
["Name","Verein","Jg","Boden",null,null,null,"Pferd",null,null,null,"Ringe",null,null,null,"Sprung",null,null,null,"Barren",null,null,null,"Reck",null,null,null,"Ges."]
[null,null,null,"D-Note","Abzug OK","E- Abzug","Note","D-Note","Abzug OK","E- Abzug","Note","D-Note","Abzug OK","E-Abzug","Note","D-Note","Abzug OK","E-Abzug","Note","D-Note","Abzug OK","E-Abzug","Note","D-Note","Abzug OK","E-Abzug","Note"]
[1,{"$f":"Formeln!A11","v":"M7"},{"$f":"IF(A9<>\"\", VLOOKUP(A9,'Wertungszettel M7'!A$7:B$36,2,0),\"\")","v":"1"},null,null,null,{"$f":"IF(AND(F9>0,F10>0),IF(OR(F9>10,F9<0,F10>10,F10<0),\"Fehler\",IF(ABS(D9)-ABS(E9)-(F9+F10)/2+10>0,IF(D9<0,-(ABS(D9)-ABS(E9)-(F9+F10)/2+10),D9-ABS(E9)-(F9+F10)/2+10),0)),0)","v":0},null,null,null,{"$f":"IF(AND(J9>0,J10>0),IF(OR(J9>10,J9<0,J10>10,J10<0),\"Fehler\",IF(ABS(H9)-ABS(I9)-(J9+J10)/2+10>0,IF(H9<0,-(ABS(H9)-ABS(I9)-(J9+J10)/2+10),H9-ABS(I9)-(J9+J10)/2+10),0)),0)","v":0},null,null,null,{"$f":"IF(AND(N9>0,N10>0),IF(OR(N9>10,N9<0,N10>10,N10<0),\"Fehler\",IF(ABS(L9)-ABS(M9)-(N9+N10)/2+10>0,IF(L9<0,-(ABS(L9)-ABS(M9)-(N9+N10)/2+10),L9-ABS(M9)-(N9+N10)/2+10),0)),0)","v":0},null,null,null,{"$f":"IF(AND(R9>0,R10>0),IF(OR(R9>10,R9<0,R10>10,R10<0),\"Fehler\",IF(ABS(P9)-ABS(Q9)-(R9+R10)/2+10>0,IF(P9<0,-(ABS(P9)-ABS(Q9)-(R9+R10)/2+10),P9-ABS(Q9)-(R9+R10)/2+10),0)),0)","v":0},null,null,null,{"$f":"IF(AND(V9>0,V10>0),IF(OR(V9>10,V9<0,V10>10,V10<0),\"Fehler\",IF(ABS(T9)-ABS(U9)-(V9+V10)/2+10>0,IF(T9<0,-(ABS(T9)-ABS(U9)-(V9+V10)/2+10),T9-ABS(U9)-(V9+V10)/2+10),0)),0)","v":0},null,null,null,{"$f":"IF(AND(Z9>0,Z10>0),IF(OR(Z9>10,Z9<0,Z10>10,Z10<0),\"Fehler\",IF(ABS(X9)-ABS(Y9)-(Z9+Z10)/2+10>0,IF(X9<0,-(ABS(X9)-ABS(Y9)-(Z9+Z10)/2+10),X9-ABS(Y9)-(Z9+Z10)/2+10),0)),0)","v":0},{"$f":"ABS(G9)+ABS(K9)+ABS(O9)+ABS(S9)+ABS(W9)+ABS(AA9)","v":0}]
[]
[2,{"$f":"IF(A11>0,B9,\"\")","v":"M7"},{"$f":"IF(A11<>\"\", VLOOKUP(A11,'Wertungszettel M7'!A$7:B$36,2,0),\"\")","v":"2"},null,null,null,{"$f":"IF(AND(F11>0,F12>0),IF(OR(F11>10,F11<0,F12>10,F12<0),\"Fehler\",IF(ABS(D11)-ABS(E11)-(F11+F12)/2+10>0,IF(D11<0,-(ABS(D11)-ABS(E11)-(F11+F12)/2+10),D11-ABS(E11)-(F11+F12)/2+10),0)),0)","v":0},null,null,null,{"$f":"IF(AND(J11>0,J12>0),IF(OR(J11>10,J11<0,J12>10,J12<0),\"Fehler\",IF(ABS(H11)-ABS(I11)-(J11+J12)/2+10>0,IF(H11<0,-(ABS(H11)-ABS(I11)-(J11+J12)/2+10),H11-ABS(I11)-(J11+J12)/2+10),0)),0)","v":0},null,null,null,{"$f":"IF(AND(N11>0,N12>0),IF(OR(N11>10,N11<0,N12>10,N12<0),\"Fehler\",IF(ABS(L11)-ABS(M11)-(N11+N12)/2+10>0,IF(L11<0,-(ABS(L11)-ABS(M11)-(N11+N12)/2+10),L11-ABS(M11)-(N11+N12)/2+10),0)),0)","v":0},null,null,null,{"$f":"IF(AND(R11>0,R12>0),IF(OR(R11>10,R11<0,R12>10,R12<0),\"Fehler\",IF(ABS(P11)-ABS(Q11)-(R11+R12)/2+10>0,IF(P11<0,-(ABS(P11)-ABS(Q11)-(R11+R12)/2+10),P11-ABS(Q11)-(R11+R12)/2+10),0)),0)","v":0},null,null,null,{"$f":"IF(AND(V11>0,V12>0),IF(OR(V11>10,V11<0,V12>10,V12<0),\"Fehler\",IF(ABS(T11)-ABS(U11)-(V11+V12)/2+10>0,IF(T11<0,-(ABS(T11)-ABS(U11)-(V11+V12)/2+10),T11-ABS(U11)-(V11+V12)/2+10),0)),0)","v":0},null,null,null,{"$f":"IF(AND(Z11>0,Z12>0),IF(OR(Z11>10,Z11<0,Z12>10,Z12<0),\"Fehler\",IF(ABS(X11)-ABS(Y11)-(Z11+Z12)/2+10>0,IF(X11<0,-(ABS(X11)-ABS(Y11)-(Z11+Z12)/2+10),X11-ABS(Y11)-(Z11+Z12)/2+10),0)),0)","v":0},{"$f":"ABS(G11)+ABS(K11)+ABS(O11)+ABS(S11)+ABS(W11)+ABS(AA11)","v":0},null,null,null,"Boden",{"$f":"IF(G30>1,1,0)","v":0}]
[null,null,null,null,null,null,null,null,null,null,null,null,null,null,null,null,null,null,null,null,null,null,null,null,null,null,null,null,null,null,null,"pauschenpferd",{"$f":"IF(K30>1,1,0)","v":0}]
[3,{"$f":"IF(A13>0,B11,\"\")","v":"M7"},{"$f":"IF(A13<>\"\", VLOOKUP(A13,'Wertungszettel M7'!A$7:B$36,2,0),\"\")","v":"3"},null,null,null,{"$f":"IF(AND(F13>0,F14>0),IF(OR(F13>10,F13<0,F14>10,F14<0),\"Fehler\",IF(ABS(D13)-ABS(E13)-(F13+F14)/2+10>0,IF(D13<0,-(ABS(D13)-ABS(E13)-(F13+F14)/2+10),D13-ABS(E13)-(F13+F14)/2+10),0)),0)","v":0},null,null,null,{"$f":"IF(AND(J13>0,J14>0),IF(OR(J13>10,J13<0,J14>10,J14<0),\"Fehler\",IF(ABS(H13)-ABS(I13)-(J13+J14)/2+10>0,IF(H13<0,-(ABS(H13)-ABS(I13)-(J13+J14)/2+10),H13-ABS(I13)-(J13+J14)/2+10),0)),0)","v":0},null,null,null,{"$f":"IF(AND(N13>0,N14>0),IF(OR(N13>10,N13<0,N14>10,N14<0),\"Fehler\",IF(ABS(L13)-ABS(M13)-(N13+N14)/2+10>0,IF(L13<0,-(ABS(L13)-ABS(M13)-(N13+N14)/2+10),L13-ABS(M13)-(N13+N14)/2+10),0)),0)","v":0},null,null,null,{"$f":"IF(AND(R13>0,R14>0),IF(OR(R13>10,R13<0,R14>10,R14<0),\"Fehler\",IF(ABS(P13)-ABS(Q13)-(R13+R14)/2+10>0,IF(P13<0,-(ABS(P13)-ABS(Q13)-(R13+R14)/2+10),P13-ABS(Q13)-(R13+R14)/2+10),0)),0)","v":0},null,null,null,{"$f":"IF(AND(V13>0,V14>0),IF(OR(V13>10,V13<0,V14>10,V14<0),\"Fehler\",IF(ABS(T13)-ABS(U13)-(V13+V14)/2+10>0,IF(T13<0,-(ABS(T13)-ABS(U13)-(V13+V14)/2+10),T13-ABS(U13)-(V13+V14)/2+10),0)),0)","v":0},null,null,null,{"$f":"IF(AND(Z13>0,Z14>0),IF(OR(Z13>10,Z13<0,Z14>10,Z14<0),\"Fehler\",IF(ABS(X13)-ABS(Y13)-(Z13+Z14)/2+10>0,IF(X13<0,-(ABS(X13)-ABS(Y13)-(Z13+Z14)/2+10),X13-ABS(Y13)-(Z13+Z14)/2+10),0)),0)","v":0},{"$f":"ABS(G13)+ABS(K13)+ABS(O13)+ABS(S13)+ABS(W13)+ABS(AA13)","v":0},null,null,null,"ringe",{"$f":"IF(O30>1,1,0)","v":0}]
[null,null,null,null,null,null,null,null,null,null,null,null,null,null,null,null,null,null,null,null,null,null,null,null,null,null,null,null,null,null,null,"sprung",{"$f":"IF(S30>1,1,0)","v":0}]
[4,{"$f":"IF(A15>0,B13,\"\")","v":"M7"},{"$f":"IF(A15<>\"\", VLOOKUP(A15,'Wertungszettel M7'!A$7:B$36,2,0),\"\")","v":"4"},null,null,null,{"$f":"IF(AND(F15>0,F16>0),IF(OR(F15>10,F15<0,F16>10,F16<0),\"Fehler\",IF(ABS(D15)-ABS(E15)-(F15+F16)/2+10>0,IF(D15<0,-(ABS(D15)-ABS(E15)-(F15+F16)/2+10),D15-ABS(E15)-(F15+F16)/2+10),0)),0)","v":0},null,null,null,{"$f":"IF(AND(J15>0,J16>0),IF(OR(J15>10,J15<0,J16>10,J16<0),\"Fehler\",IF(ABS(H15)-ABS(I15)-(J15+J16)/2+10>0,IF(H15<0,-(ABS(H15)-ABS(I15)-(J15+J16)/2+10),H15-ABS(I15)-(J15+J16)/2+10),0)),0)","v":0},null,null,null,{"$f":"IF(AND(N15>0,N16>0),IF(OR(N15>10,N15<0,N16>10,N16<0),\"Fehler\",IF(ABS(L15)-ABS(M15)-(N15+N16)/2+10>0,IF(L15<0,-(ABS(L15)-ABS(M15)-(N15+N16)/2+10),L15-ABS(M15)-(N15+N16)/2+10),0)),0)","v":0},null,null,null,{"$f":"IF(AND(R15>0,R16>0),IF(OR(R15>10,R15<0,R16>10,R16<0),\"Fehler\",IF(ABS(P15)-ABS(Q15)-(R15+R16)/2+10>0,IF(P15<0,-(ABS(P15)-ABS(Q15)-(R15+R16)/2+10),P15-ABS(Q15)-(R15+R16)/2+10),0)),0)","v":0},null,null,null,{"$f":"IF(AND(V15>0,V16>0),IF(OR(V15>10,V15<0,V16>10,V16<0),\"Fehler\",IF(ABS(T15)-ABS(U15)-(V15+V16)/2+10>0,IF(T15<0,-(ABS(T15)-ABS(U15)-(V15+V16)/2+10),T15-ABS(U15)-(V15+V16)/2+10),0)),0)","v":0},null,null,null,{"$f":"IF(AND(Z15>0,Z16>0),IF(OR(Z15>10,Z15<0,Z16>10,Z16<0),\"Fehler\",IF(ABS(X15)-ABS(Y15)-(Z15+Z16)/2+10>0,IF(X15<0,-(ABS(X15)-ABS(Y15)-(Z15+Z16)/2+10),X15-ABS(Y15)-(Z15+Z16)/2+10),0)),0)","v":0},{"$f":"ABS(G15)+ABS(K15)+ABS(O15)+ABS(S15)+ABS(W15)+ABS(AA15)","v":0},null,null,null,"Barren",{"$f":"IF(W30>1,1,0)","v":0}]
[null,null,null,null,null,null,null,null,null,null,null,null,null,null,null,null,null,null,null,null,null,null,null,null,null,null,null,null,null,null,null,"Reck",{"$f":"IF(AA30>1,1,0)","v":0}]
[5,{"$f":"IF(A17>0,B15,\"\")","v":"M7"},{"$f":"IF(A17<>\"\", VLOOKUP(A17,'Wertungszettel M7'!A$7:B$36,2,0),\"\")","v":"5"},null,null,null,{"$f":"IF(AND(F17>0,F18>0),IF(OR(F17>10,F17<0,F18>10,F18<0),\"Fehler\",IF(ABS(D17)-ABS(E17)-(F17+F18)/2+10>0,IF(D17<0,-(ABS(D17)-ABS(E17)-(F17+F18)/2+10),D17-ABS(E17)-(F17+F18)/2+10),0)),0)","v":0},null,null,null,{"$f":"IF(AND(J17>0,J18>0),IF(OR(J17>10,J17<0,J18>10,J18<0),\"Fehler\",IF(ABS(H17)-ABS(I17)-(J17+J18)/2+10>0,IF(H17<0,-(ABS(H17)-ABS(I17)-(J17+J18)/2+10),H17-ABS(I17)-(J17+J18)/2+10),0)),0)","v":0},null,null,null,{"$f":"IF(AND(N17>0,N18>0),IF(OR(N17>10,N17<0,N18>10,N18<0),\"Fehler\",IF(ABS(L17)-ABS(M17)-(N17+N18)/2+10>0,IF(L17<0,-(ABS(L17)-ABS(M17)-(N17+N18)/2+10),L17-ABS(M17)-(N17+N18)/2+10),0)),0)","v":0},null,null,null,{"$f":"IF(AND(R17>0,R18>0),IF(OR(R17>10,R17<0,R18>10,R18<0),\"Fehler\",IF(ABS(P17)-ABS(Q17)-(R17+R18)/2+10>0,IF(P17<0,-(ABS(P17)-ABS(Q17)-(R17+R18)/2+10),P17-ABS(Q17)-(R17+R18)/2+10),0)),0)","v":0},null,null,null,{"$f":"IF(AND(V17>0,V18>0),IF(OR(V17>10,V17<0,V18>10,V18<0),\"Fehler\",IF(ABS(T17)-ABS(U17)-(V17+V18)/2+10>0,IF(T17<0,-(ABS(T17)-ABS(U17)-(V17+V18)/2+10),T17-ABS(U17)-(V17+V18)/2+10),0)),0)","v":0},null,null,null,{"$f":"IF(AND(Z17>0,Z18>0),IF(OR(Z17>10,Z17<0,Z18>10,Z18<0),\"Fehler\",IF(ABS(X17)-ABS(Y17)-(Z17+Z18)/2+10>0,IF(X17<0,-(ABS(X17)-ABS(Y17)-(Z17+Z18)/2+10),X17-ABS(Y17)-(Z17+Z18)/2+10),0)),0)","v":0},{"$f":"ABS(G17)+ABS(K17)+ABS(O17)+ABS(S17)+ABS(W17)+ABS(AA17)","v":0}]
[null,null,null,null,null,null,null,null,null,null,null,null,null,null,null,null,null,null,null,null,null,null,null,null,null,null,null,null,null,null,null,"Gesamt",{"$f":"SUM(AG11:AG17)","v":0}]
[6,{"$f":"IF(A19>0,B17,\"\")","v":"M7"},{"$f":"IF(A19<>\"\", VLOOKUP(A19,'Wertungszettel M7'!A$7:B$36,2,0),\"\")","v":"6"},null,null,null,{"$f":"IF(AND(F19>0,F20>0),IF(OR(F19>10,F19<0,F20>10,F20<0),\"Fehler\",IF(ABS(D19)-ABS(E19)-(F19+F20)/2+10>0,IF(D19<0,-(ABS(D19)-ABS(E19)-(F19+F20)/2+10),D19-ABS(E19)-(F19+F20)/2+10),0)),0)","v":0},null,null,null,{"$f":"IF(AND(J19>0,J20>0),IF(OR(J19>10,J19<0,J20>10,J20<0),\"Fehler\",IF(ABS(H19)-ABS(I19)-(J19+J20)/2+10>0,IF(H19<0,-(ABS(H19)-ABS(I19)-(J19+J20)/2+10),H19-ABS(I19)-(J19+J20)/2+10),0)),0)","v":0},null,null,null,{"$f":"IF(AND(N19>0,N20>0),IF(OR(N19>10,N19<0,N20>10,N20<0),\"Fehler\",IF(ABS(L19)-ABS(M19)-(N19+N20)/2+10>0,IF(L19<0,-(ABS(L19)-ABS(M19)-(N19+N20)/2+10),L19-ABS(M19)-(N19+N20)/2+10),0)),0)","v":0},null,null,null,{"$f":"IF(AND(R19>0,R20>0),IF(OR(R19>10,R19<0,R20>10,R20<0),\"Fehler\",IF(ABS(P19)-ABS(Q19)-(R19+R20)/2+10>0,IF(P19<0,-(ABS(P19)-ABS(Q19)-(R19+R20)/2+10),P19-ABS(Q19)-(R19+R20)/2+10),0)),0)","v":0},null,null,null,{"$f":"IF(AND(V19>0,V20>0),IF(OR(V19>10,V19<0,V20>10,V20<0),\"Fehler\",IF(ABS(T19)-ABS(U19)-(V19+V20)/2+10>0,IF(T19<0,-(ABS(T19)-ABS(U19)-(V19+V20)/2+10),T19-ABS(U19)-(V19+V20)/2+10),0)),0)","v":0},null,null,null,{"$f":"IF(AND(Z19>0,Z20>0),IF(OR(Z19>10,Z19<0,Z20>10,Z20<0),\"Fehler\",IF(ABS(X19)-ABS(Y19)-(Z19+Z20)/2+10>0,IF(X19<0,-(ABS(X19)-ABS(Y19)-(Z19+Z20)/2+10),X19-ABS(Y19)-(Z19+Z20)/2+10),0)),0)","v":0},{"$f":"ABS(G19)+ABS(K19)+ABS(O19)+ABS(S19)+ABS(W19)+ABS(AA19)","v":0}]
[]
[7,{"$f":"IF(A21>0,B19,\"\")","v":"M7"},{"$f":"IF(A21<>\"\", VLOOKUP(A21,'Wertungszettel M7'!A$7:B$36,2,0),\"\")","v":"7"},null,null,null,{"$f":"IF(AND(F21>0,F22>0),IF(OR(F21>10,F21<0,F22>10,F22<0),\"Fehler\",IF(ABS(D21)-ABS(E21)-(F21+F22)/2+10>0,IF(D21<0,-(ABS(D21)-ABS(E21)-(F21+F22)/2+10),D21-ABS(E21)-(F21+F22)/2+10),0)),0)","v":0},null,null,null,{"$f":"IF(AND(J21>0,J22>0),IF(OR(J21>10,J21<0,J22>10,J22<0),\"Fehler\",IF(ABS(H21)-ABS(I21)-(J21+J22)/2+10>0,IF(H21<0,-(ABS(H21)-ABS(I21)-(J21+J22)/2+10),H21-ABS(I21)-(J21+J22)/2+10),0)),0)","v":0},null,null,null,{"$f":"IF(AND(N21>0,N22>0),IF(OR(N21>10,N21<0,N22>10,N22<0),\"Fehler\",IF(ABS(L21)-ABS(M21)-(N21+N22)/2+10>0,IF(L21<0,-(ABS(L21)-ABS(M21)-(N21+N22)/2+10),L21-ABS(M21)-(N21+N22)/2+10),0)),0)","v":0},null,null,null,{"$f":"IF(AND(R21>0,R22>0),IF(OR(R21>10,R21<0,R22>10,R22<0),\"Fehler\",IF(ABS(P21)-ABS(Q21)-(R21+R22)/2+10>0,IF(P21<0,-(ABS(P21)-ABS(Q21)-(R21+R22)/2+10),P21-ABS(Q21)-(R21+R22)/2+10),0)),0)","v":0},null,null,null,{"$f":"IF(AND(V21>0,V22>0),IF(OR(V21>10,V21<0,V22>10,V22<0),\"Fehler\",IF(ABS(T21)-ABS(U21)-(V21+V22)/2+10>0,IF(T21<0,-(ABS(T21)-ABS(U21)-(V21+V22)/2+10),T21-ABS(U21)-(V21+V22)/2+10),0)),0)","v":0},null,null,null,{"$f":"IF(AND(Z21>0,Z22>0),IF(OR(Z21>10,Z21<0,Z22>10,Z22<0),\"Fehler\",IF(ABS(X21)-ABS(Y21)-(Z21+Z22)/2+10>0,IF(X21<0,-(ABS(X21)-ABS(Y21)-(Z21+Z22)/2+10),X21-ABS(Y21)-(Z21+Z22)/2+10),0)),0)","v":0},{"$f":"ABS(G21)+ABS(K21)+ABS(O21)+ABS(S21)+ABS(W21)+ABS(AA21)","v":0}]
[]
[8,{"$f":"IF(A23>0,B21,\"\")","v":"M7"},{"$f":"IF(A23<>\"\", VLOOKUP(A23,'Wertungszettel M7'!A$7:B$36,2,0),\"\")","v":"8"},null,null,null,{"$f":"IF(AND(F23>0,F24>0),IF(OR(F23>10,F23<0,F24>10,F24<0),\"Fehler\",IF(ABS(D23)-ABS(E23)-(F23+F24)/2+10>0,IF(D23<0,-(ABS(D23)-ABS(E23)-(F23+F24)/2+10),D23-ABS(E23)-(F23+F24)/2+10),0)),0)","v":0},null,null,null,{"$f":"IF(AND(J23>0,J24>0),IF(OR(J23>10,J23<0,J24>10,J24<0),\"Fehler\",IF(ABS(H23)-ABS(I23)-(J23+J24)/2+10>0,IF(H23<0,-(ABS(H23)-ABS(I23)-(J23+J24)/2+10),H23-ABS(I23)-(J23+J24)/2+10),0)),0)","v":0},null,null,null,{"$f":"IF(AND(N23>0,N24>0),IF(OR(N23>10,N23<0,N24>10,N24<0),\"Fehler\",IF(ABS(L23)-ABS(M23)-(N23+N24)/2+10>0,IF(L23<0,-(ABS(L23)-ABS(M23)-(N23+N24)/2+10),L23-ABS(M23)-(N23+N24)/2+10),0)),0)","v":0},null,null,null,{"$f":"IF(AND(R23>0,R24>0),IF(OR(R23>10,R23<0,R24>10,R24<0),\"Fehler\",IF(ABS(P23)-ABS(Q23)-(R23+R24)/2+10>0,IF(P23<0,-(ABS(P23)-ABS(Q23)-(R23+R24)/2+10),P23-ABS(Q23)-(R23+R24)/2+10),0)),0)","v":0},null,null,null,{"$f":"IF(AND(V23>0,V24>0),IF(OR(V23>10,V23<0,V24>10,V24<0),\"Fehler\",IF(ABS(T23)-ABS(U23)-(V23+V24)/2+10>0,IF(T23<0,-(ABS(T23)-ABS(U23)-(V23+V24)/2+10),T23-ABS(U23)-(V23+V24)/2+10),0)),0)","v":0},null,null,null,{"$f":"IF(AND(Z23>0,Z24>0),IF(OR(Z23>10,Z23<0,Z24>10,Z24<0),\"Fehler\",IF(ABS(X23)-ABS(Y23)-(Z23+Z24)/2+10>0,IF(X23<0,-(ABS(X23)-ABS(Y23)-(Z23+Z24)/2+10),X23-ABS(Y23)-(Z23+Z24)/2+10),0)),0)","v":0},{"$f":"ABS(G23)+ABS(K23)+ABS(O23)+ABS(S23)+ABS(W23)+ABS(AA23)","v":0}]
[]
[9,{"$f":"IF(A25>0,B23,\"\")","v":"M7"},{"$f":"IF(A25<>\"\", VLOOKUP(A25,'Wertungszettel M7'!A$7:B$36,2,0),\"\")","v":"9"},null,null,null,{"$f":"IF(AND(F25>0,F26>0),IF(OR(F25>10,F25<0,F26>10,F26<0),\"Fehler\",IF(ABS(D25)-ABS(E25)-(F25+F26)/2+10>0,IF(D25<0,-(ABS(D25)-ABS(E25)-(F25+F26)/2+10),D25-ABS(E25)-(F25+F26)/2+10),0)),0)","v":0},null,null,null,{"$f":"IF(AND(J25>0,J26>0),IF(OR(J25>10,J25<0,J26>10,J26<0),\"Fehler\",IF(ABS(H25)-ABS(I25)-(J25+J26)/2+10>0,IF(H25<0,-(ABS(H25)-ABS(I25)-(J25+J26)/2+10),H25-ABS(I25)-(J25+J26)/2+10),0)),0)","v":0},null,null,null,{"$f":"IF(AND(N25>0,N26>0),IF(OR(N25>10,N25<0,N26>10,N26<0),\"Fehler\",IF(ABS(L25)-ABS(M25)-(N25+N26)/2+10>0,IF(L25<0,-(ABS(L25)-ABS(M25)-(N25+N26)/2+10),L25-ABS(M25)-(N25+N26)/2+10),0)),0)","v":0},null,null,null,{"$f":"IF(AND(R25>0,R26>0),IF(OR(R25>10,R25<0,R26>10,R26<0),\"Fehler\",IF(ABS(P25)-ABS(Q25)-(R25+R26)/2+10>0,IF(P25<0,-(ABS(P25)-ABS(Q25)-(R25+R26)/2+10),P25-ABS(Q25)-(R25+R26)/2+10),0)),0)","v":0},null,null,null,{"$f":"IF(AND(V25>0,V26>0),IF(OR(V25>10,V25<0,V26>10,V26<0),\"Fehler\",IF(ABS(T25)-ABS(U25)-(V25+V26)/2+10>0,IF(T25<0,-(ABS(T25)-ABS(U25)-(V25+V26)/2+10),T25-ABS(U25)-(V25+V26)/2+10),0)),0)","v":0},null,null,null,{"$f":"IF(AND(Z25>0,Z26>0),IF(OR(Z25>10,Z25<0,Z26>10,Z26<0),\"Fehler\",IF(ABS(X25)-ABS(Y25)-(Z25+Z26)/2+10>0,IF(X25<0,-(ABS(X25)-ABS(Y25)-(Z25+Z26)/2+10),X25-ABS(Y25)-(Z25+Z26)/2+10),0)),0)","v":0},{"$f":"ABS(G25)+ABS(K25)+ABS(O25)+ABS(S25)+ABS(W25)+ABS(AA25)","v":0}]
[]
[10,{"$f":"IF(A27>0,B25,\"\")","v":"M7"},{"$f":"IF(A27<>\"\", VLOOKUP(A27,'Wertungszettel M7'!A$7:B$36,2,0),\"\")","v":"10"},null,null,null,{"$f":"IF(AND(F27>0,F28>0),IF(OR(F27>10,F27<0,F28>10,F28<0),\"Fehler\",IF(ABS(D27)-ABS(E27)-(F27+F28)/2+10>0,IF(D27<0,-(ABS(D27)-ABS(E27)-(F27+F28)/2+10),D27-ABS(E27)-(F27+F28)/2+10),0)),0)","v":0},null,null,null,{"$f":"IF(AND(J27>0,J28>0),IF(OR(J27>10,J27<0,J28>10,J28<0),\"Fehler\",IF(ABS(H27)-ABS(I27)-(J27+J28)/2+10>0,IF(H27<0,-(ABS(H27)-ABS(I27)-(J27+J28)/2+10),H27-ABS(I27)-(J27+J28)/2+10),0)),0)","v":0},null,null,null,{"$f":"IF(AND(N27>0,N28>0),IF(OR(N27>10,N27<0,N28>10,N28<0),\"Fehler\",IF(ABS(L27)-ABS(M27)-(N27+N28)/2+10>0,IF(L27<0,-(ABS(L27)-ABS(M27)-(N27+N28)/2+10),L27-ABS(M27)-(N27+N28)/2+10),0)),0)","v":0},null,null,null,{"$f":"IF(AND(R27>0,R28>0),IF(OR(R27>10,R27<0,R28>10,R28<0),\"Fehler\",IF(ABS(P27)-ABS(Q27)-(R27+R28)/2+10>0,IF(P27<0,-(ABS(P27)-ABS(Q27)-(R27+R28)/2+10),P27-ABS(Q27)-(R27+R28)/2+10),0)),0)","v":0},null,null,null,{"$f":"IF(AND(V27>0,V28>0),IF(OR(V27>10,V27<0,V28>10,V28<0),\"Fehler\",IF(ABS(T27)-ABS(U27)-(V27+V28)/2+10>0,IF(T27<0,-(ABS(T27)-ABS(U27)-(V27+V28)/2+10),T27-ABS(U27)-(V27+V28)/2+10),0)),0)","v":0},null,null,null,{"$f":"IF(AND(Z27>0,Z28>0),IF(OR(Z27>10,Z27<0,Z28>10,Z28<0),\"Fehler\",IF(ABS(X27)-ABS(Y27)-(Z27+Z28)/2+10>0,IF(X27<0,-(ABS(X27)-ABS(Y27)-(Z27+Z28)/2+10),X27-ABS(Y27)-(Z27+Z28)/2+10),0)),0)","v":0},{"$f":"ABS(G27)+ABS(K27)+ABS(O27)+ABS(S27)+ABS(W27)+ABS(AA27)","v":0}]
[]
[]
[null,null,null,null,null,null,{"$f":"SUM(LARGE(G9:G28,1),LARGE(G9:G28,2),LARGE(G9:G28,3))","v":0},null,null,null,{"$f":"SUM(LARGE(K9:K28,1),LARGE(K9:K28,2),LARGE(K9:K28,3))","v":0},null,null,null,{"$f":"SUM(LARGE(O9:O28,1),LARGE(O9:O28,2),LARGE(O9:O28,3))","v":0},null,null,null,{"$f":"SUM(LARGE(S9:S28,1),LARGE(S9:S28,2),LARGE(S9:S28,3))","v":0},null,null,null,{"$f":"SUM(LARGE(W9:W28,1),LARGE(W9:W28,2),LARGE(W9:W28,3))","v":0},null,null,null,{"$f":"SUM(LARGE(AA9:AA28,1),LARGE(AA9:AA28,2),LARGE(AA9:AA28,3))","v":0},{"$f":"SUM(G30,K30,O30,S30,W30,AA30)","v":0}]

{"sheet":"M8","index":11,"n_rows":30,"n_cols":28,"rows_kept":30,"cut":false,"hidden":true,"merged":[[6,23,6,26],[0,12,0,13],[2,0,2,1],[2,5,2,7],[2,12,2,13],[8,2,9,2],[8,3,9,3],[8,4,9,4],[8,6,9,6],[6,3,6,6],[6,7,6,10],[6,11,6,14],[6,15,6,18],[6,19,6,22],[8,23,9,23],[8,24,9,24],[8,26,9,26],[8,22,9,22],[2,14,2,16],[0,14,0,16],[4,14,4,16],[8,27,9,27],[10,0,11,0],[10,1,11,1],[10,2,11,2],[10,3,11,3],[10,4,11,4],[10,6,11,6],[8,15,9,15],[8,16,9,16],[8,18,9,18],[8,19,9,19],[8,20,9,20],[10,23,11,23],[8,7,9,7],[8,8,9,8],[8,10,9,10],[8,11,9,11],[8,12,9,12],[8,14,9,14],[8,0,9,0],[8,1,9,1],[10,24,11,24],[10,26,11,26],[10,27,11,27],[12,0,13,0],[12,1,13,1],[12,2,13,2],[12,3,13,3],[12,4,13,4],[12,6,13,6],[12,7,13,7],[10,16,11,16],[10,18,11,18],[10,15,11,15],[10,19,11,19],[10,20,11,20],[10,22,11,22],[10,7,11,7],[10,8,11,8],[10,10,11,10],[10,11,11,11],[10,12,11,12],[10,14,11,14],[12,24,13,24],[12,26,13,26],[12,27,13,27],[14,0,15,0],[14,1,15,1],[14,2,15,2],[14,3,15,3],[14,4,15,4],[14,6,15,6],[14,7,15,7],[12,16,13,16],[12,18,13,18],[12,19,13,19],[12,20,13,20],[12,22,13,22],[12,23,13,23],[12,8,13,8],[12,10,13,10],[12,11,13,11],[12,12,13,12],[12,14,13,14],[12,15,13,15],[14,24,15,24],[14,26,15,26],[14,27,15,27],[16,0,17,0],[16,1,17,1],[16,2,17,2],[16,3,17,3],[16,4,17,4],[16,6,17,6],[16,7,17,7],[14,16,15,16],[14,18,15,18],[14,19,15,19],[14,20,15,20],[14,22,15,22],[14,23,15,23],[14,8,15,8],[14,10,15,10],[14,11,15,11],[14,12,15,12],[14,14,15,14],[14,15,15,15],[16,24,17,24],[16,26,17,26],[16,27,17,27],[16,19,17,19],[18,0,19,0],[18,1,19,1],[18,2,19,2],[18,3,19,3],[18,4,19,4],[18,6,19,6],[18,7,19,7],[16,16,17,16],[16,18,17,18],[16,20,17,20],[16,22,17,22],[16,23,17,23],[16,8,17,8],[16,10,17,10],[16,11,17,11],[16,12,17,12],[16,14,17,14],[16,15,17,15],[18,24,19,24],[18,26,19,26],[18,27,19,27],[20,0,21,0],[20,1,21,1],[20,2,21,2],[20,3,21,3],[20,4,21,4],[20,6,21,6],[20,7,21,7],[18,16,19,16],[18,18,19,18],[18,19,19,19],[18,20,19,20],[18,22,19,22],[18,23,19,23],[18,8,19,8],[18,10,19,10],[18,11,19,11],[18,12,19,12],[18,14,19,14],[18,15,19,15],[20,24,21,24],[20,26,21,26],[20,27,21,27],[22,0,23,0],[22,1,23,1],[22,2,23,2],[22,3,23,3],[22,4,23,4],[22,6,23,6],[22,7,23,7],[20,16,21,16],[20,18,21,18],[20,19,21,19],[20,20,21,20],[20,22,21,22],[20,23,21,23],[20,8,21,8],[20,10,21,10],[20,11,21,11],[20,12,21,12],[20,14,21,14],[20,15,21,15],[22,24,23,24],[22,26,23,26],[22,27,23,27],[22,19,23,19],[24,0,25,0],[24,1,25,1],[24,2,25,2],[24,3,25,3],[24,4,25,4],[24,6,25,6],[24,7,25,7],[22,16,23,16],[22,18,23,18],[22,20,23,20],[22,22,23,22],[22,23,23,23],[22,8,23,8],[22,10,23,10],[22,11,23,11],[22,12,23,12],[22,14,23,14],[22,15,23,15],[24,24,25,24],[24,26,25,26],[24,27,25,27],[26,0,27,0],[26,1,27,1],[26,2,27,2],[26,3,27,3],[26,4,27,4],[26,6,27,6],[26,7,27,7],[24,16,25,16],[24,18,25,18],[24,19,25,19],[24,20,25,20],[24,22,25,22],[24,23,25,23],[24,8,25,8],[24,10,25,10],[24,11,25,11],[24,12,25,12],[24,14,25,14],[24,15,25,15],[26,24,27,24],[26,26,27,26],[26,27,27,27],[26,16,27,16],[26,18,27,18],[26,19,27,19],[26,20,27,20],[26,22,27,22],[26,23,27,23],[26,8,27,8],[26,10,27,10],[26,11,27,11],[26,12,27,12],[26,14,27,14],[26,15,27,15]]}
["Wettkampfbogen",null,null,null,null,null,null,null,null,null,null,null,"Datum:",null,{"$f":"'INFO Blatt'!B13","v":"2019-02-16"}]
[]
[null,null,null,null,null,null,null,null,null,null,null,null,"Ort:",null,{"$f":"'INFO Blatt'!B11","v":"Hehlen"}]
[]
[null,null,null,null,null,null,null,null,null,null,null,null,null,"Liga:",{"$f":"'INFO Blatt'!B7","v":"Einsteigerliga"}]
[]
["Name","Verein","Jg","Boden",null,null,null,"Pferd",null,null,null,"Ringe",null,null,null,"Sprung",null,null,null,"Barren",null,null,null,"Reck",null,null,null,"Ges."]
[null,null,null,"D-Note","Abzug OK","E- Abzug","Note","D-Note","Abzug OK","E- Abzug","Note","D-Note","Abzug OK","E-Abzug","Note","D-Note","Abzug OK","E-Abzug","Note","D-Note","Abzug OK","E-Abzug","Note","D-Note","Abzug OK","E-Abzug","Note"]
[null,{"$f":"Formeln!A12","v":"M8"},{"$f":"IF(A9<>\"\", VLOOKUP(A9,'Wertungszettel M8'!A$7:B$36,2,0),\"\")","v":""},null,null,null,{"$f":"IF(AND(F9>0,F10>0),IF(OR(F9>10,F9<0,F10>10,F10<0),\"Fehler\",IF(ABS(D9)-ABS(E9)-(F9+F10)/2+10>0,IF(D9<0,-(ABS(D9)-ABS(E9)-(F9+F10)/2+10),D9-ABS(E9)-(F9+F10)/2+10),0)),0)","v":0},null,null,null,{"$f":"IF(AND(J9>0,J10>0),IF(OR(J9>10,J9<0,J10>10,J10<0),\"Fehler\",IF(ABS(H9)-ABS(I9)-(J9+J10)/2+10>0,IF(H9<0,-(ABS(H9)-ABS(I9)-(J9+J10)/2+10),H9-ABS(I9)-(J9+J10)/2+10),0)),0)","v":0},null,null,null,{"$f":"IF(AND(N9>0,N10>0),IF(OR(N9>10,N9<0,N10>10,N10<0),\"Fehler\",IF(ABS(L9)-ABS(M9)-(N9+N10)/2+10>0,IF(L9<0,-(ABS(L9)-ABS(M9)-(N9+N10)/2+10),L9-ABS(M9)-(N9+N10)/2+10),0)),0)","v":0},null,null,null,{"$f":"IF(AND(R9>0,R10>0),IF(OR(R9>10,R9<0,R10>10,R10<0),\"Fehler\",IF(ABS(P9)-ABS(Q9)-(R9+R10)/2+10>0,IF(P9<0,-(ABS(P9)-ABS(Q9)-(R9+R10)/2+10),P9-ABS(Q9)-(R9+R10)/2+10),0)),0)","v":0},null,null,null,{"$f":"IF(AND(V9>0,V10>0),IF(OR(V9>10,V9<0,V10>10,V10<0),\"Fehler\",IF(ABS(T9)-ABS(U9)-(V9+V10)/2+10>0,IF(T9<0,-(ABS(T9)-ABS(U9)-(V9+V10)/2+10),T9-ABS(U9)-(V9+V10)/2+10),0)),0)","v":0},null,null,null,{"$f":"IF(AND(Z9>0,Z10>0),IF(OR(Z9>10,Z9<0,Z10>10,Z10<0),\"Fehler\",IF(ABS(X9)-ABS(Y9)-(Z9+Z10)/2+10>0,IF(X9<0,-(ABS(X9)-ABS(Y9)-(Z9+Z10)/2+10),X9-ABS(Y9)-(Z9+Z10)/2+10),0)),0)","v":0},{"$f":"ABS(G9)+ABS(K9)+ABS(O9)+ABS(S9)+ABS(W9)+ABS(AA9)","v":0}]
[]
[null,{"$f":"IF(A11>0,B9,\"\")","v":""},{"$f":"IF(A11<>\"\", VLOOKUP(A11,'Wertungszettel M8'!A$7:B$36,2),\"\")","v":""},null,null,null,{"$f":"IF(AND(F11>0,F12>0),IF(OR(F11>10,F11<0,F12>10,F12<0),\"Fehler\",IF(ABS(D11)-ABS(E11)-(F11+F12)/2+10>0,IF(D11<0,-(ABS(D11)-ABS(E11)-(F11+F12)/2+10),D11-ABS(E11)-(F11+F12)/2+10),0)),0)","v":0},null,null,null,{"$f":"IF(AND(J11>0,J12>0),IF(OR(J11>10,J11<0,J12>10,J12<0),\"Fehler\",IF(ABS(H11)-ABS(I11)-(J11+J12)/2+10>0,IF(H11<0,-(ABS(H11)-ABS(I11)-(J11+J12)/2+10),H11-ABS(I11)-(J11+J12)/2+10),0)),0)","v":0},null,null,null,{"$f":"IF(AND(N11>0,N12>0),IF(OR(N11>10,N11<0,N12>10,N12<0),\"Fehler\",IF(ABS(L11)-ABS(M11)-(N11+N12)/2+10>0,IF(L11<0,-(ABS(L11)-ABS(M11)-(N11+N12)/2+10),L11-ABS(M11)-(N11+N12)/2+10),0)),0)","v":0},null,null,null,{"$f":"IF(AND(R11>0,R12>0),IF(OR(R11>10,R11<0,R12>10,R12<0),\"Fehler\",IF(ABS(P11)-ABS(Q11)-(R11+R12)/2+10>0,IF(P11<0,-(ABS(P11)-ABS(Q11)-(R11+R12)/2+10),P11-ABS(Q11)-(R11+R12)/2+10),0)),0)","v":0},null,null,null,{"$f":"IF(AND(V11>0,V12>0),IF(OR(V11>10,V11<0,V12>10,V12<0),\"Fehler\",IF(ABS(T11)-ABS(U11)-(V11+V12)/2+10>0,IF(T11<0,-(ABS(T11)-ABS(U11)-(V11+V12)/2+10),T11-ABS(U11)-(V11+V12)/2+10),0)),0)","v":0},null,null,null,{"$f":"IF(AND(Z11>0,Z12>0),IF(OR(Z11>10,Z11<0,Z12>10,Z12<0),\"Fehler\",IF(ABS(X11)-ABS(Y11)-(Z11+Z12)/2+10>0,IF(X11<0,-(ABS(X11)-ABS(Y11)-(Z11+Z12)/2+10),X11-ABS(Y11)-(Z11+Z12)/2+10),0)),0)","v":0},{"$f":"ABS(G11)+ABS(K11)+ABS(O11)+ABS(S11)+ABS(W11)+ABS(AA11)","v":0}]
[]
[null,{"$f":"IF(A13>0,B11,\"\")","v":""},{"$f":"IF(A13<>\"\", VLOOKUP(A13,'Wertungszettel M8'!A$7:B$36,2),\"\")","v":""},null,null,null,{"$f":"IF(AND(F13>0,F14>0),IF(OR(F13>10,F13<0,F14>10,F14<0),\"Fehler\",IF(ABS(D13)-ABS(E13)-(F13+F14)/2+10>0,IF(D13<0,-(ABS(D13)-ABS(E13)-(F13+F14)/2+10),D13-ABS(E13)-(F13+F14)/2+10),0)),0)","v":0},null,null,null,{"$f":"IF(AND(J13>0,J14>0),IF(OR(J13>10,J13<0,J14>10,J14<0),\"Fehler\",IF(ABS(H13)-ABS(I13)-(J13+J14)/2+10>0,IF(H13<0,-(ABS(H13)-ABS(I13)-(J13+J14)/2+10),H13-ABS(I13)-(J13+J14)/2+10),0)),0)","v":0},null,null,null,{"$f":"IF(AND(N13>0,N14>0),IF(OR(N13>10,N13<0,N14>10,N14<0),\"Fehler\",IF(ABS(L13)-ABS(M13)-(N13+N14)/2+10>0,IF(L13<0,-(ABS(L13)-ABS(M13)-(N13+N14)/2+10),L13-ABS(M13)-(N13+N14)/2+10),0)),0)","v":0},null,null,null,{"$f":"IF(AND(R13>0,R14>0),IF(OR(R13>10,R13<0,R14>10,R14<0),\"Fehler\",IF(ABS(P13)-ABS(Q13)-(R13+R14)/2+10>0,IF(P13<0,-(ABS(P13)-ABS(Q13)-(R13+R14)/2+10),P13-ABS(Q13)-(R13+R14)/2+10),0)),0)","v":0},null,null,null,{"$f":"IF(AND(V13>0,V14>0),IF(OR(V13>10,V13<0,V14>10,V14<0),\"Fehler\",IF(ABS(T13)-ABS(U13)-(V13+V14)/2+10>0,IF(T13<0,-(ABS(T13)-ABS(U13)-(V13+V14)/2+10),T13-ABS(U13)-(V13+V14)/2+10),0)),0)","v":0},null,null,null,{"$f":"IF(AND(Z13>0,Z14>0),IF(OR(Z13>10,Z13<0,Z14>10,Z14<0),\"Fehler\",IF(ABS(X13)-ABS(Y13)-(Z13+Z14)/2+10>0,IF(X13<0,-(ABS(X13)-ABS(Y13)-(Z13+Z14)/2+10),X13-ABS(Y13)-(Z13+Z14)/2+10),0)),0)","v":0},{"$f":"ABS(G13)+ABS(K13)+ABS(O13)+ABS(S13)+ABS(W13)+ABS(AA13)","v":0}]
[]
[null,{"$f":"IF(A15>0,B13,\"\")","v":""},{"$f":"IF(A15<>\"\", VLOOKUP(A15,'Wertungszettel M8'!A$7:B$36,2),\"\")","v":""},null,null,null,{"$f":"IF(AND(F15>0,F16>0),IF(OR(F15>10,F15<0,F16>10,F16<0),\"Fehler\",IF(ABS(D15)-ABS(E15)-(F15+F16)/2+10>0,IF(D15<0,-(ABS(D15)-ABS(E15)-(F15+F16)/2+10),D15-ABS(E15)-(F15+F16)/2+10),0)),0)","v":0},null,null,null,{"$f":"IF(AND(J15>0,J16>0),IF(OR(J15>10,J15<0,J16>10,J16<0),\"Fehler\",IF(ABS(H15)-ABS(I15)-(J15+J16)/2+10>0,IF(H15<0,-(ABS(H15)-ABS(I15)-(J15+J16)/2+10),H15-ABS(I15)-(J15+J16)/2+10),0)),0)","v":0},null,null,null,{"$f":"IF(AND(N15>0,N16>0),IF(OR(N15>10,N15<0,N16>10,N16<0),\"Fehler\",IF(ABS(L15)-ABS(M15)-(N15+N16)/2+10>0,IF(L15<0,-(ABS(L15)-ABS(M15)-(N15+N16)/2+10),L15-ABS(M15)-(N15+N16)/2+10),0)),0)","v":0},null,null,null,{"$f":"IF(AND(R15>0,R16>0),IF(OR(R15>10,R15<0,R16>10,R16<0),\"Fehler\",IF(ABS(P15)-ABS(Q15)-(R15+R16)/2+10>0,IF(P15<0,-(ABS(P15)-ABS(Q15)-(R15+R16)/2+10),P15-ABS(Q15)-(R15+R16)/2+10),0)),0)","v":0},null,null,null,{"$f":"IF(AND(V15>0,V16>0),IF(OR(V15>10,V15<0,V16>10,V16<0),\"Fehler\",IF(ABS(T15)-ABS(U15)-(V15+V16)/2+10>0,IF(T15<0,-(ABS(T15)-ABS(U15)-(V15+V16)/2+10),T15-ABS(U15)-(V15+V16)/2+10),0)),0)","v":0},null,null,null,{"$f":"IF(AND(Z15>0,Z16>0),IF(OR(Z15>10,Z15<0,Z16>10,Z16<0),\"Fehler\",IF(ABS(X15)-ABS(Y15)-(Z15+Z16)/2+10>0,IF(X15<0,-(ABS(X15)-ABS(Y15)-(Z15+Z16)/2+10),X15-ABS(Y15)-(Z15+Z16)/2+10),0)),0)","v":0},{"$f":"ABS(G15)+ABS(K15)+ABS(O15)+ABS(S15)+ABS(W15)+ABS(AA15)","v":0}]
[]
[null,{"$f":"IF(A17>0,B15,\"\")","v":""},{"$f":"IF(A17<>\"\", VLOOKUP(A17,'Wertungszettel M8'!A$7:B$36,2),\"\")","v":""},null,null,null,{"$f":"IF(AND(F17>0,F18>0),IF(OR(F17>10,F17<0,F18>10,F18<0),\"Fehler\",IF(ABS(D17)-ABS(E17)-(F17+F18)/2+10>0,IF(D17<0,-(ABS(D17)-ABS(E17)-(F17+F18)/2+10),D17-ABS(E17)-(F17+F18)/2+10),0)),0)","v":0},null,null,null,{"$f":"IF(AND(J17>0,J18>0),IF(OR(J17>10,J17<0,J18>10,J18<0),\"Fehler\",IF(ABS(H17)-ABS(I17)-(J17+J18)/2+10>0,IF(H17<0,-(ABS(H17)-ABS(I17)-(J17+J18)/2+10),H17-ABS(I17)-(J17+J18)/2+10),0)),0)","v":0},null,null,null,{"$f":"IF(AND(N17>0,N18>0),IF(OR(N17>10,N17<0,N18>10,N18<0),\"Fehler\",IF(ABS(L17)-ABS(M17)-(N17+N18)/2+10>0,IF(L17<0,-(ABS(L17)-ABS(M17)-(N17+N18)/2+10),L17-ABS(M17)-(N17+N18)/2+10),0)),0)","v":0},null,null,null,{"$f":"IF(AND(R17>0,R18>0),IF(OR(R17>10,R17<0,R18>10,R18<0),\"Fehler\",IF(ABS(P17)-ABS(Q17)-(R17+R18)/2+10>0,IF(P17<0,-(ABS(P17)-ABS(Q17)-(R17+R18)/2+10),P17-ABS(Q17)-(R17+R18)/2+10),0)),0)","v":0},null,null,null,{"$f":"IF(AND(V17>0,V18>0),IF(OR(V17>10,V17<0,V18>10,V18<0),\"Fehler\",IF(ABS(T17)-ABS(U17)-(V17+V18)/2+10>0,IF(T17<0,-(ABS(T17)-ABS(U17)-(V17+V18)/2+10),T17-ABS(U17)-(V17+V18)/2+10),0)),0)","v":0},null,null,null,{"$f":"IF(AND(Z17>0,Z18>0),IF(OR(Z17>10,Z17<0,Z18>10,Z18<0),\"Fehler\",IF(ABS(X17)-ABS(Y17)-(Z17+Z18)/2+10>0,IF(X17<0,-(ABS(X17)-ABS(Y17)-(Z17+Z18)/2+10),X17-ABS(Y17)-(Z17+Z18)/2+10),0)),0)","v":0},{"$f":"ABS(G17)+ABS(K17)+ABS(O17)+ABS(S17)+ABS(W17)+ABS(AA17)","v":0}]
[]
[null,{"$f":"IF(A19>0,B17,\"\")","v":""},{"$f":"IF(A19<>\"\", VLOOKUP(A19,'Wertungszettel M8'!A$7:B$36,2),\"\")","v":""},null,null,null,{"$f":"IF(AND(F19>0,F20>0),IF(OR(F19>10,F19<0,F20>10,F20<0),\"Fehler\",IF(ABS(D19)-ABS(E19)-(F19+F20)/2+10>0,IF(D19<0,-(ABS(D19)-ABS(E19)-(F19+F20)/2+10),D19-ABS(E19)-(F19+F20)/2+10),0)),0)","v":0},null,null,null,{"$f":"IF(AND(J19>0,J20>0),IF(OR(J19>10,J19<0,J20>10,J20<0),\"Fehler\",IF(ABS(H19)-ABS(I19)-(J19+J20)/2+10>0,IF(H19<0,-(ABS(H19)-ABS(I19)-(J19+J20)/2+10),H19-ABS(I19)-(J19+J20)/2+10),0)),0)","v":0},null,null,null,{"$f":"IF(AND(N19>0,N20>0),IF(OR(N19>10,N19<0,N20>10,N20<0),\"Fehler\",IF(ABS(L19)-ABS(M19)-(N19+N20)/2+10>0,IF(L19<0,-(ABS(L19)-ABS(M19)-(N19+N20)/2+10),L19-ABS(M19)-(N19+N20)/2+10),0)),0)","v":0},null,null,null,{"$f":"IF(AND(R19>0,R20>0),IF(OR(R19>10,R19<0,R20>10,R20<0),\"Fehler\",IF(ABS(P19)-ABS(Q19)-(R19+R20)/2+10>0,IF(P19<0,-(ABS(P19)-ABS(Q19)-(R19+R20)/2+10),P19-ABS(Q19)-(R19+R20)/2+10),0)),0)","v":0},null,null,null,{"$f":"IF(AND(V19>0,V20>0),IF(OR(V19>10,V19<0,V20>10,V20<0),\"Fehler\",IF(ABS(T19)-ABS(U19)-(V19+V20)/2+10>0,IF(T19<0,-(ABS(T19)-ABS(U19)-(V19+V20)/2+10),T19-ABS(U19)-(V19+V20)/2+10),0)),0)","v":0},null,null,null,{"$f":"IF(AND(Z19>0,Z20>0),IF(OR(Z19>10,Z19<0,Z20>10,Z20<0),\"Fehler\",IF(ABS(X19)-ABS(Y19)-(Z19+Z20)/2+10>0,IF(X19<0,-(ABS(X19)-ABS(Y19)-(Z19+Z20)/2+10),X19-ABS(Y19)-(Z19+Z20)/2+10),0)),0)","v":0},{"$f":"ABS(G19)+ABS(K19)+ABS(O19)+ABS(S19)+ABS(W19)+ABS(AA19)","v":0}]
[]
[null,{"$f":"IF(A21>0,B19,\"\")","v":""},{"$f":"IF(A21<>\"\", VLOOKUP(A21,'Wertungszettel M8'!A$7:B$36,2),\"\")","v":""},null,null,null,{"$f":"IF(AND(F21>0,F22>0),IF(OR(F21>10,F21<0,F22>10,F22<0),\"Fehler\",IF(ABS(D21)-ABS(E21)-(F21+F22)/2+10>0,IF(D21<0,-(ABS(D21)-ABS(E21)-(F21+F22)/2+10),D21-ABS(E21)-(F21+F22)/2+10),0)),0)","v":0},null,null,null,{"$f":"IF(AND(J21>0,J22>0),IF(OR(J21>10,J21<0,J22>10,J22<0),\"Fehler\",IF(ABS(H21)-ABS(I21)-(J21+J22)/2+10>0,IF(H21<0,-(ABS(H21)-ABS(I21)-(J21+J22)/2+10),H21-ABS(I21)-(J21+J22)/2+10),0)),0)","v":0},null,null,null,{"$f":"IF(AND(N21>0,N22>0),IF(OR(N21>10,N21<0,N22>10,N22<0),\"Fehler\",IF(ABS(L21)-ABS(M21)-(N21+N22)/2+10>0,IF(L21<0,-(ABS(L21)-ABS(M21)-(N21+N22)/2+10),L21-ABS(M21)-(N21+N22)/2+10),0)),0)","v":0},null,null,null,{"$f":"IF(AND(R21>0,R22>0),IF(OR(R21>10,R21<0,R22>10,R22<0),\"Fehler\",IF(ABS(P21)-ABS(Q21)-(R21+R22)/2+10>0,IF(P21<0,-(ABS(P21)-ABS(Q21)-(R21+R22)/2+10),P21-ABS(Q21)-(R21+R22)/2+10),0)),0)","v":0},null,null,null,{"$f":"IF(AND(V21>0,V22>0),IF(OR(V21>10,V21<0,V22>10,V22<0),\"Fehler\",IF(ABS(T21)-ABS(U21)-(V21+V22)/2+10>0,IF(T21<0,-(ABS(T21)-ABS(U21)-(V21+V22)/2+10),T21-ABS(U21)-(V21+V22)/2+10),0)),0)","v":0},null,null,null,{"$f":"IF(AND(Z21>0,Z22>0),IF(OR(Z21>10,Z21<0,Z22>10,Z22<0),\"Fehler\",IF(ABS(X21)-ABS(Y21)-(Z21+Z22)/2+10>0,IF(X21<0,-(ABS(X21)-ABS(Y21)-(Z21+Z22)/2+10),X21-ABS(Y21)-(Z21+Z22)/2+10),0)),0)","v":0},{"$f":"ABS(G21)+ABS(K21)+ABS(O21)+ABS(S21)+ABS(W21)+ABS(AA21)","v":0}]
[]
[null,{"$f":"IF(A23>0,B21,\"\")","v":""},{"$f":"IF(A23<>\"\", VLOOKUP(A23,'Wertungszettel M8'!A$7:B$36,2),\"\")","v":""},null,null,null,{"$f":"IF(AND(F23>0,F24>0),IF(OR(F23>10,F23<0,F24>10,F24<0),\"Fehler\",IF(ABS(D23)-ABS(E23)-(F23+F24)/2+10>0,IF(D23<0,-(ABS(D23)-ABS(E23)-(F23+F24)/2+10),D23-ABS(E23)-(F23+F24)/2+10),0)),0)","v":0},null,null,null,{"$f":"IF(AND(J23>0,J24>0),IF(OR(J23>10,J23<0,J24>10,J24<0),\"Fehler\",IF(ABS(H23)-ABS(I23)-(J23+J24)/2+10>0,IF(H23<0,-(ABS(H23)-ABS(I23)-(J23+J24)/2+10),H23-ABS(I23)-(J23+J24)/2+10),0)),0)","v":0},null,null,null,{"$f":"IF(AND(N23>0,N24>0),IF(OR(N23>10,N23<0,N24>10,N24<0),\"Fehler\",IF(ABS(L23)-ABS(M23)-(N23+N24)/2+10>0,IF(L23<0,-(ABS(L23)-ABS(M23)-(N23+N24)/2+10),L23-ABS(M23)-(N23+N24)/2+10),0)),0)","v":0},null,null,null,{"$f":"IF(AND(R23>0,R24>0),IF(OR(R23>10,R23<0,R24>10,R24<0),\"Fehler\",IF(ABS(P23)-ABS(Q23)-(R23+R24)/2+10>0,IF(P23<0,-(ABS(P23)-ABS(Q23)-(R23+R24)/2+10),P23-ABS(Q23)-(R23+R24)/2+10),0)),0)","v":0},null,null,null,{"$f":"IF(AND(V23>0,V24>0),IF(OR(V23>10,V23<0,V24>10,V24<0),\"Fehler\",IF(ABS(T23)-ABS(U23)-(V23+V24)/2+10>0,IF(T23<0,-(ABS(T23)-ABS(U23)-(V23+V24)/2+10),T23-ABS(U23)-(V23+V24)/2+10),0)),0)","v":0},null,null,null,{"$f":"IF(AND(Z23>0,Z24>0),IF(OR(Z23>10,Z23<0,Z24>10,Z24<0),\"Fehler\",IF(ABS(X23)-ABS(Y23)-(Z23+Z24)/2+10>0,IF(X23<0,-(ABS(X23)-ABS(Y23)-(Z23+Z24)/2+10),X23-ABS(Y23)-(Z23+Z24)/2+10),0)),0)","v":0},{"$f":"ABS(G23)+ABS(K23)+ABS(O23)+ABS(S23)+ABS(W23)+ABS(AA23)","v":0}]
[]
[null,{"$f":"IF(A25>0,B23,\"\")","v":""},{"$f":"IF(A25<>\"\", VLOOKUP(A25,'Wertungszettel M8'!A$7:B$36,2),\"\")","v":""},null,null,null,{"$f":"IF(AND(F25>0,F26>0),IF(OR(F25>10,F25<0,F26>10,F26<0),\"Fehler\",IF(ABS(D25)-ABS(E25)-(F25+F26)/2+10>0,IF(D25<0,-(ABS(D25)-ABS(E25)-(F25+F26)/2+10),D25-ABS(E25)-(F25+F26)/2+10),0)),0)","v":0},null,null,null,{"$f":"IF(AND(J25>0,J26>0),IF(OR(J25>10,J25<0,J26>10,J26<0),\"Fehler\",IF(ABS(H25)-ABS(I25)-(J25+J26)/2+10>0,IF(H25<0,-(ABS(H25)-ABS(I25)-(J25+J26)/2+10),H25-ABS(I25)-(J25+J26)/2+10),0)),0)","v":0},null,null,null,{"$f":"IF(AND(N25>0,N26>0),IF(OR(N25>10,N25<0,N26>10,N26<0),\"Fehler\",IF(ABS(L25)-ABS(M25)-(N25+N26)/2+10>0,IF(L25<0,-(ABS(L25)-ABS(M25)-(N25+N26)/2+10),L25-ABS(M25)-(N25+N26)/2+10),0)),0)","v":0},null,null,null,{"$f":"IF(AND(R25>0,R26>0),IF(OR(R25>10,R25<0,R26>10,R26<0),\"Fehler\",IF(ABS(P25)-ABS(Q25)-(R25+R26)/2+10>0,IF(P25<0,-(ABS(P25)-ABS(Q25)-(R25+R26)/2+10),P25-ABS(Q25)-(R25+R26)/2+10),0)),0)","v":0},null,null,null,{"$f":"IF(AND(V25>0,V26>0),IF(OR(V25>10,V25<0,V26>10,V26<0),\"Fehler\",IF(ABS(T25)-ABS(U25)-(V25+V26)/2+10>0,IF(T25<0,-(ABS(T25)-ABS(U25)-(V25+V26)/2+10),T25-ABS(U25)-(V25+V26)/2+10),0)),0)","v":0},null,null,null,{"$f":"IF(AND(Z25>0,Z26>0),IF(OR(Z25>10,Z25<0,Z26>10,Z26<0),\"Fehler\",IF(ABS(X25)-ABS(Y25)-(Z25+Z26)/2+10>0,IF(X25<0,-(ABS(X25)-ABS(Y25)-(Z25+Z26)/2+10),X25-ABS(Y25)-(Z25+Z26)/2+10),0)),0)","v":0},{"$f":"ABS(G25)+ABS(K25)+ABS(O25)+ABS(S25)+ABS(W25)+ABS(AA25)","v":0}]
[]
[null,{"$f":"IF(A27>0,B25,\"\")","v":""},{"$f":"IF(A27<>\"\", VLOOKUP(A27,'Wertungszettel M8'!A$7:B$36,2),\"\")","v":""},null,null,null,{"$f":"IF(AND(F27>0,F28>0),IF(OR(F27>10,F27<0,F28>10,F28<0),\"Fehler\",IF(ABS(D27)-ABS(E27)-(F27+F28)/2+10>0,IF(D27<0,-(ABS(D27)-ABS(E27)-(F27+F28)/2+10),D27-ABS(E27)-(F27+F28)/2+10),0)),0)","v":0},null,null,null,{"$f":"IF(AND(J27>0,J28>0),IF(OR(J27>10,J27<0,J28>10,J28<0),\"Fehler\",IF(ABS(H27)-ABS(I27)-(J27+J28)/2+10>0,IF(H27<0,-(ABS(H27)-ABS(I27)-(J27+J28)/2+10),H27-ABS(I27)-(J27+J28)/2+10),0)),0)","v":0},null,null,null,{"$f":"IF(AND(N27>0,N28>0),IF(OR(N27>10,N27<0,N28>10,N28<0),\"Fehler\",IF(ABS(L27)-ABS(M27)-(N27+N28)/2+10>0,IF(L27<0,-(ABS(L27)-ABS(M27)-(N27+N28)/2+10),L27-ABS(M27)-(N27+N28)/2+10),0)),0)","v":0},null,null,null,{"$f":"IF(AND(R27>0,R28>0),IF(OR(R27>10,R27<0,R28>10,R28<0),\"Fehler\",IF(ABS(P27)-ABS(Q27)-(R27+R28)/2+10>0,IF(P27<0,-(ABS(P27)-ABS(Q27)-(R27+R28)/2+10),P27-ABS(Q27)-(R27+R28)/2+10),0)),0)","v":0},null,null,null,{"$f":"IF(AND(V27>0,V28>0),IF(OR(V27>10,V27<0,V28>10,V28<0),\"Fehler\",IF(ABS(T27)-ABS(U27)-(V27+V28)/2+10>0,IF(T27<0,-(ABS(T27)-ABS(U27)-(V27+V28)/2+10),T27-ABS(U27)-(V27+V28)/2+10),0)),0)","v":0},null,null,null,{"$f":"IF(AND(Z27>0,Z28>0),IF(OR(Z27>10,Z27<0,Z28>10,Z28<0),\"Fehler\",IF(ABS(X27)-ABS(Y27)-(Z27+Z28)/2+10>0,IF(X27<0,-(ABS(X27)-ABS(Y27)-(Z27+Z28)/2+10),X27-ABS(Y27)-(Z27+Z28)/2+10),0)),0)","v":0},{"$f":"ABS(G27)+ABS(K27)+ABS(O27)+ABS(S27)+ABS(W27)+ABS(AA27)","v":0}]
[]
[]
[null,null,null,null,null,null,{"$f":"SUM(LARGE(G9:G28,1),LARGE(G9:G28,2),LARGE(G9:G28,3))","v":0},null,null,null,{"$f":"SUM(LARGE(K9:K28,1),LARGE(K9:K28,2),LARGE(K9:K28,3))","v":0},null,null,null,{"$f":"SUM(LARGE(O9:O28,1),LARGE(O9:O28,2),LARGE(O9:O28,3))","v":0},null,null,null,{"$f":"SUM(LARGE(S9:S28,1),LARGE(S9:S28,2),LARGE(S9:S28,3))","v":0},null,null,null,{"$f":"SUM(LARGE(W9:W28,1),LARGE(W9:W28,2),LARGE(W9:W28,3))","v":0},null,null,null,{"$f":"SUM(LARGE(AA9:AA28,1),LARGE(AA9:AA28,2),LARGE(AA9:AA28,3))","v":0},{"$f":"SUM(G30,K30,O30,S30,W30,AA30)","v":0}]

{"sheet":"M9","index":12,"n_rows":30,"n_cols":28,"rows_kept":30,"cut":false,"hidden":true,"merged":[[6,23,6,26],[0,12,0,13],[2,0,2,1],[2,5,2,7],[2,12,2,13],[8,2,9,2],[8,3,9,3],[8,4,9,4],[8,6,9,6],[6,3,6,6],[6,7,6,10],[6,11,6,14],[6,15,6,18],[6,19,6,22],[8,23,9,23],[8,24,9,24],[8,26,9,26],[8,22,9,22],[2,14,2,16],[0,14,0,16],[4,14,4,16],[8,27,9,27],[10,0,11,0],[10,1,11,1],[10,2,11,2],[10,3,11,3],[10,4,11,4],[10,6,11,6],[8,15,9,15],[8,16,9,16],[8,18,9,18],[8,19,9,19],[8,20,9,20],[10,23,11,23],[8,7,9,7],[8,8,9,8],[8,10,9,10],[8,11,9,11],[8,12,9,12],[8,14,9,14],[8,0,9,0],[8,1,9,1],[10,24,11,24],[10,26,11,26],[10,27,11,27],[12,0,13,0],[12,1,13,1],[12,2,13,2],[12,3,13,3],[12,4,13,4],[12,6,13,6],[12,7,13,7],[10,16,11,16],[10,18,11,18],[10,15,11,15],[10,19,11,19],[10,20,11,20],[10,22,11,22],[10,7,11,7],[10,8,11,8],[10,10,11,10],[10,11,11,11],[10,12,11,12],[10,14,11,14],[12,24,13,24],[12,26,13,26],[12,27,13,27],[14,0,15,0],[14,1,15,1],[14,2,15,2],[14,3,15,3],[14,4,15,4],[14,6,15,6],[14,7,15,7],[12,16,13,16],[12,18,13,18],[12,19,13,19],[12,20,13,20],[12,22,13,22],[12,23,13,23],[12,8,13,8],[12,10,13,10],[12,11,13,11],[12,12,13,12],[12,14,13,14],[12,15,13,15],[14,24,15,24],[14,26,15,26],[14,27,15,27],[16,0,17,0],[16,1,17,1],[16,2,17,2],[16,3,17,3],[16,4,17,4],[16,6,17,6],[16,7,17,7],[14,16,15,16],[14,18,15,18],[14,19,15,19],[14,20,15,20],[14,22,15,22],[14,23,15,23],[14,8,15,8],[14,10,15,10],[14,11,15,11],[14,12,15,12],[14,14,15,14],[14,15,15,15],[16,24,17,24],[16,26,17,26],[16,27,17,27],[16,19,17,19],[18,0,19,0],[18,1,19,1],[18,2,19,2],[18,3,19,3],[18,4,19,4],[18,6,19,6],[18,7,19,7],[16,16,17,16],[16,18,17,18],[16,20,17,20],[16,22,17,22],[16,23,17,23],[16,8,17,8],[16,10,17,10],[16,11,17,11],[16,12,17,12],[16,14,17,14],[16,15,17,15],[18,24,19,24],[18,26,19,26],[18,27,19,27],[20,0,21,0],[20,1,21,1],[20,2,21,2],[20,3,21,3],[20,4,21,4],[20,6,21,6],[20,7,21,7],[18,16,19,16],[18,18,19,18],[18,19,19,19],[18,20,19,20],[18,22,19,22],[18,23,19,23],[18,8,19,8],[18,10,19,10],[18,11,19,11],[18,12,19,12],[18,14,19,14],[18,15,19,15],[20,24,21,24],[20,26,21,26],[20,27,21,27],[22,0,23,0],[22,1,23,1],[22,2,23,2],[22,3,23,3],[22,4,23,4],[22,6,23,6],[22,7,23,7],[20,16,21,16],[20,18,21,18],[20,19,21,19],[20,20,21,20],[20,22,21,22],[20,23,21,23],[20,8,21,8],[20,10,21,10],[20,11,21,11],[20,12,21,12],[20,14,21,14],[20,15,21,15],[22,24,23,24],[22,26,23,26],[22,27,23,27],[22,19,23,19],[24,0,25,0],[24,1,25,1],[24,2,25,2],[24,3,25,3],[24,4,25,4],[24,6,25,6],[24,7,25,7],[22,16,23,16],[22,18,23,18],[22,20,23,20],[22,22,23,22],[22,23,23,23],[22,8,23,8],[22,10,23,10],[22,11,23,11],[22,12,23,12],[22,14,23,14],[22,15,23,15],[24,24,25,24],[24,26,25,26],[24,27,25,27],[26,0,27,0],[26,1,27,1],[26,2,27,2],[26,3,27,3],[26,4,27,4],[26,6,27,6],[26,7,27,7],[24,16,25,16],[24,18,25,18],[24,19,25,19],[24,20,25,20],[24,22,25,22],[24,23,25,23],[24,8,25,8],[24,10,25,10],[24,11,25,11],[24,12,25,12],[24,14,25,14],[24,15,25,15],[26,24,27,24],[26,26,27,26],[26,27,27,27],[26,16,27,16],[26,18,27,18],[26,19,27,19],[26,20,27,20],[26,22,27,22],[26,23,27,23],[26,8,27,8],[26,10,27,10],[26,11,27,11],[26,12,27,12],[26,14,27,14],[26,15,27,15]]}
["Wettkampfbogen",null,null,null,null,null,null,null,null,null,null,null,"Datum:",null,{"$f":"'INFO Blatt'!B13","v":"2019-02-16"}]
[]
[null,null,null,null,null,null,null,null,null,null,null,null,"Ort:",null,{"$f":"'INFO Blatt'!B11","v":"Hehlen"}]
[]
[null,null,null,null,null,null,null,null,null,null,null,null,null,"Liga:",{"$f":"'INFO Blatt'!B7","v":"Einsteigerliga"}]
[]
["Name","Verein","Jg","Boden",null,null,null,"Pferd",null,null,null,"Ringe",null,null,null,"Sprung",null,null,null,"Barren",null,null,null,"Reck",null,null,null,"Ges."]
[null,null,null,"D-Note","Abzug OK","E- Abzug","Note","D-Note","Abzug OK","E- Abzug","Note","D-Note","Abzug OK","E-Abzug","Note","D-Note","Abzug OK","E-Abzug","Note","D-Note","Abzug OK","E-Abzug","Note","D-Note","Abzug OK","E-Abzug","Note"]
[null,{"$f":"Formeln!A13","v":"M9"},{"$f":"IF(A9<>\"\", VLOOKUP(A9,'Wertungszettel M9'!A$7:B$36,2,0),\"\")","v":""},null,null,null,{"$f":"IF(AND(F9>0,F10>0),IF(OR(F9>10,F9<0,F10>10,F10<0),\"Fehler\",IF(ABS(D9)-ABS(E9)-(F9+F10)/2+10>0,IF(D9<0,-(ABS(D9)-ABS(E9)-(F9+F10)/2+10),D9-ABS(E9)-(F9+F10)/2+10),0)),0)","v":0},null,null,null,{"$f":"IF(AND(J9>0,J10>0),IF(OR(J9>10,J9<0,J10>10,J10<0),\"Fehler\",IF(ABS(H9)-ABS(I9)-(J9+J10)/2+10>0,IF(H9<0,-(ABS(H9)-ABS(I9)-(J9+J10)/2+10),H9-ABS(I9)-(J9+J10)/2+10),0)),0)","v":0},null,null,null,{"$f":"IF(AND(N9>0,N10>0),IF(OR(N9>10,N9<0,N10>10,N10<0),\"Fehler\",IF(ABS(L9)-ABS(M9)-(N9+N10)/2+10>0,IF(L9<0,-(ABS(L9)-ABS(M9)-(N9+N10)/2+10),L9-ABS(M9)-(N9+N10)/2+10),0)),0)","v":0},null,null,null,{"$f":"IF(AND(R9>0,R10>0),IF(OR(R9>10,R9<0,R10>10,R10<0),\"Fehler\",IF(ABS(P9)-ABS(Q9)-(R9+R10)/2+10>0,IF(P9<0,-(ABS(P9)-ABS(Q9)-(R9+R10)/2+10),P9-ABS(Q9)-(R9+R10)/2+10),0)),0)","v":0},null,null,null,{"$f":"IF(AND(V9>0,V10>0),IF(OR(V9>10,V9<0,V10>10,V10<0),\"Fehler\",IF(ABS(T9)-ABS(U9)-(V9+V10)/2+10>0,IF(T9<0,-(ABS(T9)-ABS(U9)-(V9+V10)/2+10),T9-ABS(U9)-(V9+V10)/2+10),0)),0)","v":0},null,null,null,{"$f":"IF(AND(Z9>0,Z10>0),IF(OR(Z9>10,Z9<0,Z10>10,Z10<0),\"Fehler\",IF(ABS(X9)-ABS(Y9)-(Z9+Z10)/2+10>0,IF(X9<0,-(ABS(X9)-ABS(Y9)-(Z9+Z10)/2+10),X9-ABS(Y9)-(Z9+Z10)/2+10),0)),0)","v":0},{"$f":"ABS(G9)+ABS(K9)+ABS(O9)+ABS(S9)+ABS(W9)+ABS(AA9)","v":0}]
[]
[null,{"$f":"IF(A11>0,B9,\"\")","v":""},{"$f":"IF(A11<>\"\", VLOOKUP(A11,'Wertungszettel M9'!A$7:B$36,2,0),\"\")","v":""},null,null,null,{"$f":"IF(AND(F11>0,F12>0),IF(OR(F11>10,F11<0,F12>10,F12<0),\"Fehler\",IF(ABS(D11)-ABS(E11)-(F11+F12)/2+10>0,IF(D11<0,-(ABS(D11)-ABS(E11)-(F11+F12)/2+10),D11-ABS(E11)-(F11+F12)/2+10),0)),0)","v":0},null,null,null,{"$f":"IF(AND(J11>0,J12>0),IF(OR(J11>10,J11<0,J12>10,J12<0),\"Fehler\",IF(ABS(H11)-ABS(I11)-(J11+J12)/2+10>0,IF(H11<0,-(ABS(H11)-ABS(I11)-(J11+J12)/2+10),H11-ABS(I11)-(J11+J12)/2+10),0)),0)","v":0},null,null,null,{"$f":"IF(AND(N11>0,N12>0),IF(OR(N11>10,N11<0,N12>10,N12<0),\"Fehler\",IF(ABS(L11)-ABS(M11)-(N11+N12)/2+10>0,IF(L11<0,-(ABS(L11)-ABS(M11)-(N11+N12)/2+10),L11-ABS(M11)-(N11+N12)/2+10),0)),0)","v":0},null,null,null,{"$f":"IF(AND(R11>0,R12>0),IF(OR(R11>10,R11<0,R12>10,R12<0),\"Fehler\",IF(ABS(P11)-ABS(Q11)-(R11+R12)/2+10>0,IF(P11<0,-(ABS(P11)-ABS(Q11)-(R11+R12)/2+10),P11-ABS(Q11)-(R11+R12)/2+10),0)),0)","v":0},null,null,null,{"$f":"IF(AND(V11>0,V12>0),IF(OR(V11>10,V11<0,V12>10,V12<0),\"Fehler\",IF(ABS(T11)-ABS(U11)-(V11+V12)/2+10>0,IF(T11<0,-(ABS(T11)-ABS(U11)-(V11+V12)/2+10),T11-ABS(U11)-(V11+V12)/2+10),0)),0)","v":0},null,null,null,{"$f":"IF(AND(Z11>0,Z12>0),IF(OR(Z11>10,Z11<0,Z12>10,Z12<0),\"Fehler\",IF(ABS(X11)-ABS(Y11)-(Z11+Z12)/2+10>0,IF(X11<0,-(ABS(X11)-ABS(Y11)-(Z11+Z12)/2+10),X11-ABS(Y11)-(Z11+Z12)/2+10),0)),0)","v":0},{"$f":"ABS(G11)+ABS(K11)+ABS(O11)+ABS(S11)+ABS(W11)+ABS(AA11)","v":0}]
[]
[null,{"$f":"IF(A13>0,B11,\"\")","v":""},{"$f":"IF(A13<>\"\", VLOOKUP(A13,'Wertungszettel M9'!A$7:B$36,2,0),\"\")","v":""},null,null,null,{"$f":"IF(AND(F13>0,F14>0),IF(OR(F13>10,F13<0,F14>10,F14<0),\"Fehler\",IF(ABS(D13)-ABS(E13)-(F13+F14)/2+10>0,IF(D13<0,-(ABS(D13)-ABS(E13)-(F13+F14)/2+10),D13-ABS(E13)-(F13+F14)/2+10),0)),0)","v":0},null,null,null,{"$f":"IF(AND(J13>0,J14>0),IF(OR(J13>10,J13<0,J14>10,J14<0),\"Fehler\",IF(ABS(H13)-ABS(I13)-(J13+J14)/2+10>0,IF(H13<0,-(ABS(H13)-ABS(I13)-(J13+J14)/2+10),H13-ABS(I13)-(J13+J14)/2+10),0)),0)","v":0},null,null,null,{"$f":"IF(AND(N13>0,N14>0),IF(OR(N13>10,N13<0,N14>10,N14<0),\"Fehler\",IF(ABS(L13)-ABS(M13)-(N13+N14)/2+10>0,IF(L13<0,-(ABS(L13)-ABS(M13)-(N13+N14)/2+10),L13-ABS(M13)-(N13+N14)/2+10),0)),0)","v":0},null,null,null,{"$f":"IF(AND(R13>0,R14>0),IF(OR(R13>10,R13<0,R14>10,R14<0),\"Fehler\",IF(ABS(P13)-ABS(Q13)-(R13+R14)/2+10>0,IF(P13<0,-(ABS(P13)-ABS(Q13)-(R13+R14)/2+10),P13-ABS(Q13)-(R13+R14)/2+10),0)),0)","v":0},null,null,null,{"$f":"IF(AND(V13>0,V14>0),IF(OR(V13>10,V13<0,V14>10,V14<0),\"Fehler\",IF(ABS(T13)-ABS(U13)-(V13+V14)/2+10>0,IF(T13<0,-(ABS(T13)-ABS(U13)-(V13+V14)/2+10),T13-ABS(U13)-(V13+V14)/2+10),0)),0)","v":0},null,null,null,{"$f":"IF(AND(Z13>0,Z14>0),IF(OR(Z13>10,Z13<0,Z14>10,Z14<0),\"Fehler\",IF(ABS(X13)-ABS(Y13)-(Z13+Z14)/2+10>0,IF(X13<0,-(ABS(X13)-ABS(Y13)-(Z13+Z14)/2+10),X13-ABS(Y13)-(Z13+Z14)/2+10),0)),0)","v":0},{"$f":"ABS(G13)+ABS(K13)+ABS(O13)+ABS(S13)+ABS(W13)+ABS(AA13)","v":0}]
[]
[null,{"$f":"IF(A15>0,B13,\"\")","v":""},{"$f":"IF(A15<>\"\", VLOOKUP(A15,'Wertungszettel M9'!A$7:B$36,2,0),\"\")","v":""},null,null,null,{"$f":"IF(AND(F15>0,F16>0),IF(OR(F15>10,F15<0,F16>10,F16<0),\"Fehler\",IF(ABS(D15)-ABS(E15)-(F15+F16)/2+10>0,IF(D15<0,-(ABS(D15)-ABS(E15)-(F15+F16)/2+10),D15-ABS(E15)-(F15+F16)/2+10),0)),0)","v":0},null,null,null,{"$f":"IF(AND(J15>0,J16>0),IF(OR(J15>10,J15<0,J16>10,J16<0),\"Fehler\",IF(ABS(H15)-ABS(I15)-(J15+J16)/2+10>0,IF(H15<0,-(ABS(H15)-ABS(I15)-(J15+J16)/2+10),H15-ABS(I15)-(J15+J16)/2+10),0)),0)","v":0},null,null,null,{"$f":"IF(AND(N15>0,N16>0),IF(OR(N15>10,N15<0,N16>10,N16<0),\"Fehler\",IF(ABS(L15)-ABS(M15)-(N15+N16)/2+10>0,IF(L15<0,-(ABS(L15)-ABS(M15)-(N15+N16)/2+10),L15-ABS(M15)-(N15+N16)/2+10),0)),0)","v":0},null,null,null,{"$f":"IF(AND(R15>0,R16>0),IF(OR(R15>10,R15<0,R16>10,R16<0),\"Fehler\",IF(ABS(P15)-ABS(Q15)-(R15+R16)/2+10>0,IF(P15<0,-(ABS(P15)-ABS(Q15)-(R15+R16)/2+10),P15-ABS(Q15)-(R15+R16)/2+10),0)),0)","v":0},null,null,null,{"$f":"IF(AND(V15>0,V16>0),IF(OR(V15>10,V15<0,V16>10,V16<0),\"Fehler\",IF(ABS(T15)-ABS(U15)-(V15+V16)/2+10>0,IF(T15<0,-(ABS(T15)-ABS(U15)-(V15+V16)/2+10),T15-ABS(U15)-(V15+V16)/2+10),0)),0)","v":0},null,null,null,{"$f":"IF(AND(Z15>0,Z16>0),IF(OR(Z15>10,Z15<0,Z16>10,Z16<0),\"Fehler\",IF(ABS(X15)-ABS(Y15)-(Z15+Z16)/2+10>0,IF(X15<0,-(ABS(X15)-ABS(Y15)-(Z15+Z16)/2+10),X15-ABS(Y15)-(Z15+Z16)/2+10),0)),0)","v":0},{"$f":"ABS(G15)+ABS(K15)+ABS(O15)+ABS(S15)+ABS(W15)+ABS(AA15)","v":0}]
[]
[null,{"$f":"IF(A17>0,B15,\"\")","v":""},{"$f":"IF(A17<>\"\", VLOOKUP(A17,'Wertungszettel M9'!A$7:B$36,2,0),\"\")","v":""},null,null,null,{"$f":"IF(AND(F17>0,F18>0),IF(OR(F17>10,F17<0,F18>10,F18<0),\"Fehler\",IF(ABS(D17)-ABS(E17)-(F17+F18)/2+10>0,IF(D17<0,-(ABS(D17)-ABS(E17)-(F17+F18)/2+10),D17-ABS(E17)-(F17+F18)/2+10),0)),0)","v":0},null,null,null,{"$f":"IF(AND(J17>0,J18>0),IF(OR(J17>10,J17<0,J18>10,J18<0),\"Fehler\",IF(ABS(H17)-ABS(I17)-(J17+J18)/2+10>0,IF(H17<0,-(ABS(H17)-ABS(I17)-(J17+J18)/2+10),H17-ABS(I17)-(J17+J18)/2+10),0)),0)","v":0},null,null,null,{"$f":"IF(AND(N17>0,N18>0),IF(OR(N17>10,N17<0,N18>10,N18<0),\"Fehler\",IF(ABS(L17)-ABS(M17)-(N17+N18)/2+10>0,IF(L17<0,-(ABS(L17)-ABS(M17)-(N17+N18)/2+10),L17-ABS(M17)-(N17+N18)/2+10),0)),0)","v":0},null,null,null,{"$f":"IF(AND(R17>0,R18>0),IF(OR(R17>10,R17<0,R18>10,R18<0),\"Fehler\",IF(ABS(P17)-ABS(Q17)-(R17+R18)/2+10>0,IF(P17<0,-(ABS(P17)-ABS(Q17)-(R17+R18)/2+10),P17-ABS(Q17)-(R17+R18)/2+10),0)),0)","v":0},null,null,null,{"$f":"IF(AND(V17>0,V18>0),IF(OR(V17>10,V17<0,V18>10,V18<0),\"Fehler\",IF(ABS(T17)-ABS(U17)-(V17+V18)/2+10>0,IF(T17<0,-(ABS(T17)-ABS(U17)-(V17+V18)/2+10),T17-ABS(U17)-(V17+V18)/2+10),0)),0)","v":0},null,null,null,{"$f":"IF(AND(Z17>0,Z18>0),IF(OR(Z17>10,Z17<0,Z18>10,Z18<0),\"Fehler\",IF(ABS(X17)-ABS(Y17)-(Z17+Z18)/2+10>0,IF(X17<0,-(ABS(X17)-ABS(Y17)-(Z17+Z18)/2+10),X17-ABS(Y17)-(Z17+Z18)/2+10),0)),0)","v":0},{"$f":"ABS(G17)+ABS(K17)+ABS(O17)+ABS(S17)+ABS(W17)+ABS(AA17)","v":0}]
[]
[null,{"$f":"IF(A19>0,B17,\"\")","v":""},{"$f":"IF(A19<>\"\", VLOOKUP(A19,'Wertungszettel M9'!A$7:B$36,2,0),\"\")","v":""},null,null,null,{"$f":"IF(AND(F19>0,F20>0),IF(OR(F19>10,F19<0,F20>10,F20<0),\"Fehler\",IF(ABS(D19)-ABS(E19)-(F19+F20)/2+10>0,IF(D19<0,-(ABS(D19)-ABS(E19)-(F19+F20)/2+10),D19-ABS(E19)-(F19+F20)/2+10),0)),0)","v":0},null,null,null,{"$f":"IF(AND(J19>0,J20>0),IF(OR(J19>10,J19<0,J20>10,J20<0),\"Fehler\",IF(ABS(H19)-ABS(I19)-(J19+J20)/2+10>0,IF(H19<0,-(ABS(H19)-ABS(I19)-(J19+J20)/2+10),H19-ABS(I19)-(J19+J20)/2+10),0)),0)","v":0},null,null,null,{"$f":"IF(AND(N19>0,N20>0),IF(OR(N19>10,N19<0,N20>10,N20<0),\"Fehler\",IF(ABS(L19)-ABS(M19)-(N19+N20)/2+10>0,IF(L19<0,-(ABS(L19)-ABS(M19)-(N19+N20)/2+10),L19-ABS(M19)-(N19+N20)/2+10),0)),0)","v":0},null,null,null,{"$f":"IF(AND(R19>0,R20>0),IF(OR(R19>10,R19<0,R20>10,R20<0),\"Fehler\",IF(ABS(P19)-ABS(Q19)-(R19+R20)/2+10>0,IF(P19<0,-(ABS(P19)-ABS(Q19)-(R19+R20)/2+10),P19-ABS(Q19)-(R19+R20)/2+10),0)),0)","v":0},null,null,null,{"$f":"IF(AND(V19>0,V20>0),IF(OR(V19>10,V19<0,V20>10,V20<0),\"Fehler\",IF(ABS(T19)-ABS(U19)-(V19+V20)/2+10>0,IF(T19<0,-(ABS(T19)-ABS(U19)-(V19+V20)/2+10),T19-ABS(U19)-(V19+V20)/2+10),0)),0)","v":0},null,null,null,{"$f":"IF(AND(Z19>0,Z20>0),IF(OR(Z19>10,Z19<0,Z20>10,Z20<0),\"Fehler\",IF(ABS(X19)-ABS(Y19)-(Z19+Z20)/2+10>0,IF(X19<0,-(ABS(X19)-ABS(Y19)-(Z19+Z20)/2+10),X19-ABS(Y19)-(Z19+Z20)/2+10),0)),0)","v":0},{"$f":"ABS(G19)+ABS(K19)+ABS(O19)+ABS(S19)+ABS(W19)+ABS(AA19)","v":0}]
[]
[null,{"$f":"IF(A21>0,B19,\"\")","v":""},{"$f":"IF(A21<>\"\", VLOOKUP(A21,'Wertungszettel M9'!A$7:B$36,2,0),\"\")","v":""},null,null,null,{"$f":"IF(AND(F21>0,F22>0),IF(OR(F21>10,F21<0,F22>10,F22<0),\"Fehler\",IF(ABS(D21)-ABS(E21)-(F21+F22)/2+10>0,IF(D21<0,-(ABS(D21)-ABS(E21)-(F21+F22)/2+10),D21-ABS(E21)-(F21+F22)/2+10),0)),0)","v":0},null,null,null,{"$f":"IF(AND(J21>0,J22>0),IF(OR(J21>10,J21<0,J22>10,J22<0),\"Fehler\",IF(ABS(H21)-ABS(I21)-(J21+J22)/2+10>0,IF(H21<0,-(ABS(H21)-ABS(I21)-(J21+J22)/2+10),H21-ABS(I21)-(J21+J22)/2+10),0)),0)","v":0},null,null,null,{"$f":"IF(AND(N21>0,N22>0),IF(OR(N21>10,N21<0,N22>10,N22<0),\"Fehler\",IF(ABS(L21)-ABS(M21)-(N21+N22)/2+10>0,IF(L21<0,-(ABS(L21)-ABS(M21)-(N21+N22)/2+10),L21-ABS(M21)-(N21+N22)/2+10),0)),0)","v":0},null,null,null,{"$f":"IF(AND(R21>0,R22>0),IF(OR(R21>10,R21<0,R22>10,R22<0),\"Fehler\",IF(ABS(P21)-ABS(Q21)-(R21+R22)/2+10>0,IF(P21<0,-(ABS(P21)-ABS(Q21)-(R21+R22)/2+10),P21-ABS(Q21)-(R21+R22)/2+10),0)),0)","v":0},null,null,null,{"$f":"IF(AND(V21>0,V22>0),IF(OR(V21>10,V21<0,V22>10,V22<0),\"Fehler\",IF(ABS(T21)-ABS(U21)-(V21+V22)/2+10>0,IF(T21<0,-(ABS(T21)-ABS(U21)-(V21+V22)/2+10),T21-ABS(U21)-(V21+V22)/2+10),0)),0)","v":0},null,null,null,{"$f":"IF(AND(Z21>0,Z22>0),IF(OR(Z21>10,Z21<0,Z22>10,Z22<0),\"Fehler\",IF(ABS(X21)-ABS(Y21)-(Z21+Z22)/2+10>0,IF(X21<0,-(ABS(X21)-ABS(Y21)-(Z21+Z22)/2+10),X21-ABS(Y21)-(Z21+Z22)/2+10),0)),0)","v":0},{"$f":"ABS(G21)+ABS(K21)+ABS(O21)+ABS(S21)+ABS(W21)+ABS(AA21)","v":0}]
[]
[null,{"$f":"IF(A23>0,B21,\"\")","v":""},{"$f":"IF(A23<>\"\", VLOOKUP(A23,'Wertungszettel M9'!A$7:B$36,2,0),\"\")","v":""},null,null,null,{"$f":"IF(AND(F23>0,F24>0),IF(OR(F23>10,F23<0,F24>10,F24<0),\"Fehler\",IF(ABS(D23)-ABS(E23)-(F23+F24)/2+10>0,IF(D23<0,-(ABS(D23)-ABS(E23)-(F23+F24)/2+10),D23-ABS(E23)-(F23+F24)/2+10),0)),0)","v":0},null,null,null,{"$f":"IF(AND(J23>0,J24>0),IF(OR(J23>10,J23<0,J24>10,J24<0),\"Fehler\",IF(ABS(H23)-ABS(I23)-(J23+J24)/2+10>0,IF(H23<0,-(ABS(H23)-ABS(I23)-(J23+J24)/2+10),H23-ABS(I23)-(J23+J24)/2+10),0)),0)","v":0},null,null,null,{"$f":"IF(AND(N23>0,N24>0),IF(OR(N23>10,N23<0,N24>10,N24<0),\"Fehler\",IF(ABS(L23)-ABS(M23)-(N23+N24)/2+10>0,IF(L23<0,-(ABS(L23)-ABS(M23)-(N23+N24)/2+10),L23-ABS(M23)-(N23+N24)/2+10),0)),0)","v":0},null,null,null,{"$f":"IF(AND(R23>0,R24>0),IF(OR(R23>10,R23<0,R24>10,R24<0),\"Fehler\",IF(ABS(P23)-ABS(Q23)-(R23+R24)/2+10>0,IF(P23<0,-(ABS(P23)-ABS(Q23)-(R23+R24)/2+10),P23-ABS(Q23)-(R23+R24)/2+10),0)),0)","v":0},null,null,null,{"$f":"IF(AND(V23>0,V24>0),IF(OR(V23>10,V23<0,V24>10,V24<0),\"Fehler\",IF(ABS(T23)-ABS(U23)-(V23+V24)/2+10>0,IF(T23<0,-(ABS(T23)-ABS(U23)-(V23+V24)/2+10),T23-ABS(U23)-(V23+V24)/2+10),0)),0)","v":0},null,null,null,{"$f":"IF(AND(Z23>0,Z24>0),IF(OR(Z23>10,Z23<0,Z24>10,Z24<0),\"Fehler\",IF(ABS(X23)-ABS(Y23)-(Z23+Z24)/2+10>0,IF(X23<0,-(ABS(X23)-ABS(Y23)-(Z23+Z24)/2+10),X23-ABS(Y23)-(Z23+Z24)/2+10),0)),0)","v":0},{"$f":"ABS(G23)+ABS(K23)+ABS(O23)+ABS(S23)+ABS(W23)+ABS(AA23)","v":0}]
[]
[null,{"$f":"IF(A25>0,B23,\"\")","v":""},{"$f":"IF(A25<>\"\", VLOOKUP(A25,'Wertungszettel M9'!A$7:B$36,2,0),\"\")","v":""},null,null,null,{"$f":"IF(AND(F25>0,F26>0),IF(OR(F25>10,F25<0,F26>10,F26<0),\"Fehler\",IF(ABS(D25)-ABS(E25)-(F25+F26)/2+10>0,IF(D25<0,-(ABS(D25)-ABS(E25)-(F25+F26)/2+10),D25-ABS(E25)-(F25+F26)/2+10),0)),0)","v":0},null,null,null,{"$f":"IF(AND(J25>0,J26>0),IF(OR(J25>10,J25<0,J26>10,J26<0),\"Fehler\",IF(ABS(H25)-ABS(I25)-(J25+J26)/2+10>0,IF(H25<0,-(ABS(H25)-ABS(I25)-(J25+J26)/2+10),H25-ABS(I25)-(J25+J26)/2+10),0)),0)","v":0},null,null,null,{"$f":"IF(AND(N25>0,N26>0),IF(OR(N25>10,N25<0,N26>10,N26<0),\"Fehler\",IF(ABS(L25)-ABS(M25)-(N25+N26)/2+10>0,IF(L25<0,-(ABS(L25)-ABS(M25)-(N25+N26)/2+10),L25-ABS(M25)-(N25+N26)/2+10),0)),0)","v":0},null,null,null,{"$f":"IF(AND(R25>0,R26>0),IF(OR(R25>10,R25<0,R26>10,R26<0),\"Fehler\",IF(ABS(P25)-ABS(Q25)-(R25+R26)/2+10>0,IF(P25<0,-(ABS(P25)-ABS(Q25)-(R25+R26)/2+10),P25-ABS(Q25)-(R25+R26)/2+10),0)),0)","v":0},null,null,null,{"$f":"IF(AND(V25>0,V26>0),IF(OR(V25>10,V25<0,V26>10,V26<0),\"Fehler\",IF(ABS(T25)-ABS(U25)-(V25+V26)/2+10>0,IF(T25<0,-(ABS(T25)-ABS(U25)-(V25+V26)/2+10),T25-ABS(U25)-(V25+V26)/2+10),0)),0)","v":0},null,null,null,{"$f":"IF(AND(Z25>0,Z26>0),IF(OR(Z25>10,Z25<0,Z26>10,Z26<0),\"Fehler\",IF(ABS(X25)-ABS(Y25)-(Z25+Z26)/2+10>0,IF(X25<0,-(ABS(X25)-ABS(Y25)-(Z25+Z26)/2+10),X25-ABS(Y25)-(Z25+Z26)/2+10),0)),0)","v":0},{"$f":"ABS(G25)+ABS(K25)+ABS(O25)+ABS(S25)+ABS(W25)+ABS(AA25)","v":0}]
[]
[null,{"$f":"IF(A27>0,B25,\"\")","v":""},{"$f":"IF(A27<>\"\", VLOOKUP(A27,'Wertungszettel M9'!A$7:B$36,2,0),\"\")","v":""},null,null,null,{"$f":"IF(AND(F27>0,F28>0),IF(OR(F27>10,F27<0,F28>10,F28<0),\"Fehler\",IF(ABS(D27)-ABS(E27)-(F27+F28)/2+10>0,IF(D27<0,-(ABS(D27)-ABS(E27)-(F27+F28)/2+10),D27-ABS(E27)-(F27+F28)/2+10),0)),0)","v":0},null,null,null,{"$f":"IF(AND(J27>0,J28>0),IF(OR(J27>10,J27<0,J28>10,J28<0),\"Fehler\",IF(ABS(H27)-ABS(I27)-(J27+J28)/2+10>0,IF(H27<0,-(ABS(H27)-ABS(I27)-(J27+J28)/2+10),H27-ABS(I27)-(J27+J28)/2+10),0)),0)","v":0},null,null,null,{"$f":"IF(AND(N27>0,N28>0),IF(OR(N27>10,N27<0,N28>10,N28<0),\"Fehler\",IF(ABS(L27)-ABS(M27)-(N27+N28)/2+10>0,IF(L27<0,-(ABS(L27)-ABS(M27)-(N27+N28)/2+10),L27-ABS(M27)-(N27+N28)/2+10),0)),0)","v":0},null,null,null,{"$f":"IF(AND(R27>0,R28>0),IF(OR(R27>10,R27<0,R28>10,R28<0),\"Fehler\",IF(ABS(P27)-ABS(Q27)-(R27+R28)/2+10>0,IF(P27<0,-(ABS(P27)-ABS(Q27)-(R27+R28)/2+10),P27-ABS(Q27)-(R27+R28)/2+10),0)),0)","v":0},null,null,null,{"$f":"IF(AND(V27>0,V28>0),IF(OR(V27>10,V27<0,V28>10,V28<0),\"Fehler\",IF(ABS(T27)-ABS(U27)-(V27+V28)/2+10>0,IF(T27<0,-(ABS(T27)-ABS(U27)-(V27+V28)/2+10),T27-ABS(U27)-(V27+V28)/2+10),0)),0)","v":0},null,null,null,{"$f":"IF(AND(Z27>0,Z28>0),IF(OR(Z27>10,Z27<0,Z28>10,Z28<0),\"Fehler\",IF(ABS(X27)-ABS(Y27)-(Z27+Z28)/2+10>0,IF(X27<0,-(ABS(X27)-ABS(Y27)-(Z27+Z28)/2+10),X27-ABS(Y27)-(Z27+Z28)/2+10),0)),0)","v":0},{"$f":"ABS(G27)+ABS(K27)+ABS(O27)+ABS(S27)+ABS(W27)+ABS(AA27)","v":0}]
[]
[]
[null,null,null,null,null,null,{"$f":"SUM(LARGE(G9:G28,1),LARGE(G9:G28,2),LARGE(G9:G28,3))","v":0},null,null,null,{"$f":"SUM(LARGE(K9:K28,1),LARGE(K9:K28,2),LARGE(K9:K28,3))","v":0},null,null,null,{"$f":"SUM(LARGE(O9:O28,1),LARGE(O9:O28,2),LARGE(O9:O28,3))","v":0},null,null,null,{"$f":"SUM(LARGE(S9:S28,1),LARGE(S9:S28,2),LARGE(S9:S28,3))","v":0},null,null,null,{"$f":"SUM(LARGE(W9:W28,1),LARGE(W9:W28,2),LARGE(W9:W28,3))","v":0},null,null,null,{"$f":"SUM(LARGE(AA9:AA28,1),LARGE(AA9:AA28,2),LARGE(AA9:AA28,3))","v":0},{"$f":"SUM(G30,K30,O30,S30,W30,AA30)","v":0}]

{"sheet":"M10","index":13,"n_rows":30,"n_cols":28,"rows_kept":30,"cut":false,"hidden":true,"merged":[[6,23,6,26],[0,12,0,13],[2,0,2,1],[2,5,2,7],[2,12,2,13],[8,2,9,2],[8,3,9,3],[8,4,9,4],[8,6,9,6],[6,3,6,6],[6,7,6,10],[6,11,6,14],[6,15,6,18],[6,19,6,22],[8,23,9,23],[8,24,9,24],[8,26,9,26],[8,22,9,22],[2,14,2,16],[0,14,0,16],[4,14,4,16],[8,27,9,27],[10,0,11,0],[10,1,11,1],[10,2,11,2],[10,3,11,3],[10,4,11,4],[10,6,11,6],[8,15,9,15],[8,16,9,16],[8,18,9,18],[8,19,9,19],[8,20,9,20],[10,23,11,23],[8,7,9,7],[8,8,9,8],[8,10,9,10],[8,11,9,11],[8,12,9,12],[8,14,9,14],[8,0,9,0],[8,1,9,1],[10,24,11,24],[10,26,11,26],[10,27,11,27],[12,0,13,0],[12,1,13,1],[12,2,13,2],[12,3,13,3],[12,4,13,4],[12,6,13,6],[12,7,13,7],[10,16,11,16],[10,18,11,18],[10,15,11,15],[10,19,11,19],[10,20,11,20],[10,22,11,22],[10,7,11,7],[10,8,11,8],[10,10,11,10],[10,11,11,11],[10,12,11,12],[10,14,11,14],[12,24,13,24],[12,26,13,26],[12,27,13,27],[14,0,15,0],[14,1,15,1],[14,2,15,2],[14,3,15,3],[14,4,15,4],[14,6,15,6],[14,7,15,7],[12,16,13,16],[12,18,13,18],[12,19,13,19],[12,20,13,20],[12,22,13,22],[12,23,13,23],[12,8,13,8],[12,10,13,10],[12,11,13,11],[12,12,13,12],[12,14,13,14],[12,15,13,15],[14,24,15,24],[14,26,15,26],[14,27,15,27],[16,0,17,0],[16,1,17,1],[16,2,17,2],[16,3,17,3],[16,4,17,4],[16,6,17,6],[16,7,17,7],[14,16,15,16],[14,18,15,18],[14,19,15,19],[14,20,15,20],[14,22,15,22],[14,23,15,23],[14,8,15,8],[14,10,15,10],[14,11,15,11],[14,12,15,12],[14,14,15,14],[14,15,15,15],[16,24,17,24],[16,26,17,26],[16,27,17,27],[16,19,17,19],[18,0,19,0],[18,1,19,1],[18,2,19,2],[18,3,19,3],[18,4,19,4],[18,6,19,6],[18,7,19,7],[16,16,17,16],[16,18,17,18],[16,20,17,20],[16,22,17,22],[16,23,17,23],[16,8,17,8],[16,10,17,10],[16,11,17,11],[16,12,17,12],[16,14,17,14],[16,15,17,15],[18,24,19,24],[18,26,19,26],[18,27,19,27],[20,0,21,0],[20,1,21,1],[20,2,21,2],[20,3,21,3],[20,4,21,4],[20,6,21,6],[20,7,21,7],[18,16,19,16],[18,18,19,18],[18,19,19,19],[18,20,19,20],[18,22,19,22],[18,23,19,23],[18,8,19,8],[18,10,19,10],[18,11,19,11],[18,12,19,12],[18,14,19,14],[18,15,19,15],[20,24,21,24],[20,26,21,26],[20,27,21,27],[22,0,23,0],[22,1,23,1],[22,2,23,2],[22,3,23,3],[22,4,23,4],[22,6,23,6],[22,7,23,7],[20,16,21,16],[20,18,21,18],[20,19,21,19],[20,20,21,20],[20,22,21,22],[20,23,21,23],[20,8,21,8],[20,10,21,10],[20,11,21,11],[20,12,21,12],[20,14,21,14],[20,15,21,15],[22,24,23,24],[22,26,23,26],[22,27,23,27],[22,19,23,19],[24,0,25,0],[24,1,25,1],[24,2,25,2],[24,3,25,3],[24,4,25,4],[24,6,25,6],[24,7,25,7],[22,16,23,16],[22,18,23,18],[22,20,23,20],[22,22,23,22],[22,23,23,23],[22,8,23,8],[22,10,23,10],[22,11,23,11],[22,12,23,12],[22,14,23,14],[22,15,23,15],[24,24,25,24],[24,26,25,26],[24,27,25,27],[26,0,27,0],[26,1,27,1],[26,2,27,2],[26,3,27,3],[26,4,27,4],[26,6,27,6],[26,7,27,7],[24,16,25,16],[24,18,25,18],[24,19,25,19],[24,20,25,20],[24,22,25,22],[24,23,25,23],[24,8,25,8],[24,10,25,10],[24,11,25,11],[24,12,25,12],[24,14,25,14],[24,15,25,15],[26,24,27,24],[26,26,27,26],[26,27,27,27],[26,16,27,16],[26,18,27,18],[26,19,27,19],[26,20,27,20],[26,22,27,22],[26,23,27,23],[26,8,27,8],[26,10,27,10],[26,11,27,11],[26,12,27,12],[26,14,27,14],[26,15,27,15]]}
["Wettkampfbogen",null,null,null,null,null,null,null,null,null,null,null,"Datum:",null,{"$f":"'INFO Blatt'!B13","v":"2019-02-16"}]
[]
[null,null,null,null,null,null,null,null,null,null,null,null,"Ort:",null,{"$f":"'INFO Blatt'!B11","v":"Hehlen"}]
[]
[null,null,null,null,null,null,null,null,null,null,null,null,null,"Liga:",{"$f":"'INFO Blatt'!B7","v":"Einsteigerliga"}]
[]
["Name","Verein","Jg","Boden",null,null,null,"Pferd",null,null,null,"Ringe",null,null,null,"Sprung",null,null,null,"Barren",null,null,null,"Reck",null,null,null,"Ges."]
[null,null,null,"D-Note","Abzug OK","E- Abzug","Note","D-Note","Abzug OK","E- Abzug","Note","D-Note","Abzug OK","E-Abzug","Note","D-Note","Abzug OK","E-Abzug","Note","D-Note","Abzug OK","E-Abzug","Note","D-Note","Abzug OK","E-Abzug","Note"]
[null,{"$f":"Formeln!A14","v":"M10"},{"$f":"IF(A9<>\"\", VLOOKUP(A9,'Wertungszettel M10'!A$7:B$36,2,0),\"\")","v":""},null,null,null,{"$f":"IF(AND(F9>0,F10>0),IF(OR(F9>10,F9<0,F10>10,F10<0),\"Fehler\",IF(ABS(D9)-ABS(E9)-(F9+F10)/2+10>0,IF(D9<0,-(ABS(D9)-ABS(E9)-(F9+F10)/2+10),D9-ABS(E9)-(F9+F10)/2+10),0)),0)","v":0},null,null,null,{"$f":"IF(AND(J9>0,J10>0),IF(OR(J9>10,J9<0,J10>10,J10<0),\"Fehler\",IF(ABS(H9)-ABS(I9)-(J9+J10)/2+10>0,IF(H9<0,-(ABS(H9)-ABS(I9)-(J9+J10)/2+10),H9-ABS(I9)-(J9+J10)/2+10),0)),0)","v":0},null,null,null,{"$f":"IF(AND(N9>0,N10>0),IF(OR(N9>10,N9<0,N10>10,N10<0),\"Fehler\",IF(ABS(L9)-ABS(M9)-(N9+N10)/2+10>0,IF(L9<0,-(ABS(L9)-ABS(M9)-(N9+N10)/2+10),L9-ABS(M9)-(N9+N10)/2+10),0)),0)","v":0},null,null,null,{"$f":"IF(AND(R9>0,R10>0),IF(OR(R9>10,R9<0,R10>10,R10<0),\"Fehler\",IF(ABS(P9)-ABS(Q9)-(R9+R10)/2+10>0,IF(P9<0,-(ABS(P9)-ABS(Q9)-(R9+R10)/2+10),P9-ABS(Q9)-(R9+R10)/2+10),0)),0)","v":0},null,null,null,{"$f":"IF(AND(V9>0,V10>0),IF(OR(V9>10,V9<0,V10>10,V10<0),\"Fehler\",IF(ABS(T9)-ABS(U9)-(V9+V10)/2+10>0,IF(T9<0,-(ABS(T9)-ABS(U9)-(V9+V10)/2+10),T9-ABS(U9)-(V9+V10)/2+10),0)),0)","v":0},null,null,null,{"$f":"IF(AND(Z9>0,Z10>0),IF(OR(Z9>10,Z9<0,Z10>10,Z10<0),\"Fehler\",IF(ABS(X9)-ABS(Y9)-(Z9+Z10)/2+10>0,IF(X9<0,-(ABS(X9)-ABS(Y9)-(Z9+Z10)/2+10),X9-ABS(Y9)-(Z9+Z10)/2+10),0)),0)","v":0},{"$f":"ABS(G9)+ABS(K9)+ABS(O9)+ABS(S9)+ABS(W9)+ABS(AA9)","v":0}]
[]
[null,{"$f":"IF(A11>0,B9,\"\")","v":""},{"$f":"IF(A11<>\"\", VLOOKUP(A11,'Wertungszettel M10'!A$7:B$36,2),\"\")","v":""},null,null,null,{"$f":"IF(AND(F11>0,F12>0),IF(OR(F11>10,F11<0,F12>10,F12<0),\"Fehler\",IF(ABS(D11)-ABS(E11)-(F11+F12)/2+10>0,IF(D11<0,-(ABS(D11)-ABS(E11)-(F11+F12)/2+10),D11-ABS(E11)-(F11+F12)/2+10),0)),0)","v":0},null,null,null,{"$f":"IF(AND(J11>0,J12>0),IF(OR(J11>10,J11<0,J12>10,J12<0),\"Fehler\",IF(ABS(H11)-ABS(I11)-(J11+J12)/2+10>0,IF(H11<0,-(ABS(H11)-ABS(I11)-(J11+J12)/2+10),H11-ABS(I11)-(J11+J12)/2+10),0)),0)","v":0},null,null,null,{"$f":"IF(AND(N11>0,N12>0),IF(OR(N11>10,N11<0,N12>10,N12<0),\"Fehler\",IF(ABS(L11)-ABS(M11)-(N11+N12)/2+10>0,IF(L11<0,-(ABS(L11)-ABS(M11)-(N11+N12)/2+10),L11-ABS(M11)-(N11+N12)/2+10),0)),0)","v":0},null,null,null,{"$f":"IF(AND(R11>0,R12>0),IF(OR(R11>10,R11<0,R12>10,R12<0),\"Fehler\",IF(ABS(P11)-ABS(Q11)-(R11+R12)/2+10>0,IF(P11<0,-(ABS(P11)-ABS(Q11)-(R11+R12)/2+10),P11-ABS(Q11)-(R11+R12)/2+10),0)),0)","v":0},null,null,null,{"$f":"IF(AND(V11>0,V12>0),IF(OR(V11>10,V11<0,V12>10,V12<0),\"Fehler\",IF(ABS(T11)-ABS(U11)-(V11+V12)/2+10>0,IF(T11<0,-(ABS(T11)-ABS(U11)-(V11+V12)/2+10),T11-ABS(U11)-(V11+V12)/2+10),0)),0)","v":0},null,null,null,{"$f":"IF(AND(Z11>0,Z12>0),IF(OR(Z11>10,Z11<0,Z12>10,Z12<0),\"Fehler\",IF(ABS(X11)-ABS(Y11)-(Z11+Z12)/2+10>0,IF(X11<0,-(ABS(X11)-ABS(Y11)-(Z11+Z12)/2+10),X11-ABS(Y11)-(Z11+Z12)/2+10),0)),0)","v":0},{"$f":"ABS(G11)+ABS(K11)+ABS(O11)+ABS(S11)+ABS(W11)+ABS(AA11)","v":0}]
[]
[null,{"$f":"IF(A13>0,B11,\"\")","v":""},{"$f":"IF(A13<>\"\", VLOOKUP(A13,'Wertungszettel M10'!A$7:B$36,2),\"\")","v":""},null,null,null,{"$f":"IF(AND(F13>0,F14>0),IF(OR(F13>10,F13<0,F14>10,F14<0),\"Fehler\",IF(ABS(D13)-ABS(E13)-(F13+F14)/2+10>0,IF(D13<0,-(ABS(D13)-ABS(E13)-(F13+F14)/2+10),D13-ABS(E13)-(F13+F14)/2+10),0)),0)","v":0},null,null,null,{"$f":"IF(AND(J13>0,J14>0),IF(OR(J13>10,J13<0,J14>10,J14<0),\"Fehler\",IF(ABS(H13)-ABS(I13)-(J13+J14)/2+10>0,IF(H13<0,-(ABS(H13)-ABS(I13)-(J13+J14)/2+10),H13-ABS(I13)-(J13+J14)/2+10),0)),0)","v":0},null,null,null,{"$f":"IF(AND(N13>0,N14>0),IF(OR(N13>10,N13<0,N14>10,N14<0),\"Fehler\",IF(ABS(L13)-ABS(M13)-(N13+N14)/2+10>0,IF(L13<0,-(ABS(L13)-ABS(M13)-(N13+N14)/2+10),L13-ABS(M13)-(N13+N14)/2+10),0)),0)","v":0},null,null,null,{"$f":"IF(AND(R13>0,R14>0),IF(OR(R13>10,R13<0,R14>10,R14<0),\"Fehler\",IF(ABS(P13)-ABS(Q13)-(R13+R14)/2+10>0,IF(P13<0,-(ABS(P13)-ABS(Q13)-(R13+R14)/2+10),P13-ABS(Q13)-(R13+R14)/2+10),0)),0)","v":0},null,null,null,{"$f":"IF(AND(V13>0,V14>0),IF(OR(V13>10,V13<0,V14>10,V14<0),\"Fehler\",IF(ABS(T13)-ABS(U13)-(V13+V14)/2+10>0,IF(T13<0,-(ABS(T13)-ABS(U13)-(V13+V14)/2+10),T13-ABS(U13)-(V13+V14)/2+10),0)),0)","v":0},null,null,null,{"$f":"IF(AND(Z13>0,Z14>0),IF(OR(Z13>10,Z13<0,Z14>10,Z14<0),\"Fehler\",IF(ABS(X13)-ABS(Y13)-(Z13+Z14)/2+10>0,IF(X13<0,-(ABS(X13)-ABS(Y13)-(Z13+Z14)/2+10),X13-ABS(Y13)-(Z13+Z14)/2+10),0)),0)","v":0},{"$f":"ABS(G13)+ABS(K13)+ABS(O13)+ABS(S13)+ABS(W13)+ABS(AA13)","v":0}]
[]
[null,{"$f":"IF(A15>0,B13,\"\")","v":""},{"$f":"IF(A15<>\"\", VLOOKUP(A15,'Wertungszettel M10'!A$7:B$36,2),\"\")","v":""},null,null,null,{"$f":"IF(AND(F15>0,F16>0),IF(OR(F15>10,F15<0,F16>10,F16<0),\"Fehler\",IF(ABS(D15)-ABS(E15)-(F15+F16)/2+10>0,IF(D15<0,-(ABS(D15)-ABS(E15)-(F15+F16)/2+10),D15-ABS(E15)-(F15+F16)/2+10),0)),0)","v":0},null,null,null,{"$f":"IF(AND(J15>0,J16>0),IF(OR(J15>10,J15<0,J16>10,J16<0),\"Fehler\",IF(ABS(H15)-ABS(I15)-(J15+J16)/2+10>0,IF(H15<0,-(ABS(H15)-ABS(I15)-(J15+J16)/2+10),H15-ABS(I15)-(J15+J16)/2+10),0)),0)","v":0},null,null,null,{"$f":"IF(AND(N15>0,N16>0),IF(OR(N15>10,N15<0,N16>10,N16<0),\"Fehler\",IF(ABS(L15)-ABS(M15)-(N15+N16)/2+10>0,IF(L15<0,-(ABS(L15)-ABS(M15)-(N15+N16)/2+10),L15-ABS(M15)-(N15+N16)/2+10),0)),0)","v":0},null,null,null,{"$f":"IF(AND(R15>0,R16>0),IF(OR(R15>10,R15<0,R16>10,R16<0),\"Fehler\",IF(ABS(P15)-ABS(Q15)-(R15+R16)/2+10>0,IF(P15<0,-(ABS(P15)-ABS(Q15)-(R15+R16)/2+10),P15-ABS(Q15)-(R15+R16)/2+10),0)),0)","v":0},null,null,null,{"$f":"IF(AND(V15>0,V16>0),IF(OR(V15>10,V15<0,V16>10,V16<0),\"Fehler\",IF(ABS(T15)-ABS(U15)-(V15+V16)/2+10>0,IF(T15<0,-(ABS(T15)-ABS(U15)-(V15+V16)/2+10),T15-ABS(U15)-(V15+V16)/2+10),0)),0)","v":0},null,null,null,{"$f":"IF(AND(Z15>0,Z16>0),IF(OR(Z15>10,Z15<0,Z16>10,Z16<0),\"Fehler\",IF(ABS(X15)-ABS(Y15)-(Z15+Z16)/2+10>0,IF(X15<0,-(ABS(X15)-ABS(Y15)-(Z15+Z16)/2+10),X15-ABS(Y15)-(Z15+Z16)/2+10),0)),0)","v":0},{"$f":"ABS(G15)+ABS(K15)+ABS(O15)+ABS(S15)+ABS(W15)+ABS(AA15)","v":0}]
[]
[null,{"$f":"IF(A17>0,B15,\"\")","v":""},{"$f":"IF(A17<>\"\", VLOOKUP(A17,'Wertungszettel M10'!A$7:B$36,2),\"\")","v":""},null,null,null,{"$f":"IF(AND(F17>0,F18>0),IF(OR(F17>10,F17<0,F18>10,F18<0),\"Fehler\",IF(ABS(D17)-ABS(E17)-(F17+F18)/2+10>0,IF(D17<0,-(ABS(D17)-ABS(E17)-(F17+F18)/2+10),D17-ABS(E17)-(F17+F18)/2+10),0)),0)","v":0},null,null,null,{"$f":"IF(AND(J17>0,J18>0),IF(OR(J17>10,J17<0,J18>10,J18<0),\"Fehler\",IF(ABS(H17)-ABS(I17)-(J17+J18)/2+10>0,IF(H17<0,-(ABS(H17)-ABS(I17)-(J17+J18)/2+10),H17-ABS(I17)-(J17+J18)/2+10),0)),0)","v":0},null,null,null,{"$f":"IF(AND(N17>0,N18>0),IF(OR(N17>10,N17<0,N18>10,N18<0),\"Fehler\",IF(ABS(L17)-ABS(M17)-(N17+N18)/2+10>0,IF(L17<0,-(ABS(L17)-ABS(M17)-(N17+N18)/2+10),L17-ABS(M17)-(N17+N18)/2+10),0)),0)","v":0},null,null,null,{"$f":"IF(AND(R17>0,R18>0),IF(OR(R17>10,R17<0,R18>10,R18<0),\"Fehler\",IF(ABS(P17)-ABS(Q17)-(R17+R18)/2+10>0,IF(P17<0,-(ABS(P17)-ABS(Q17)-(R17+R18)/2+10),P17-ABS(Q17)-(R17+R18)/2+10),0)),0)","v":0},null,null,null,{"$f":"IF(AND(V17>0,V18>0),IF(OR(V17>10,V17<0,V18>10,V18<0),\"Fehler\",IF(ABS(T17)-ABS(U17)-(V17+V18)/2+10>0,IF(T17<0,-(ABS(T17)-ABS(U17)-(V17+V18)/2+10),T17-ABS(U17)-(V17+V18)/2+10),0)),0)","v":0},null,null,null,{"$f":"IF(AND(Z17>0,Z18>0),IF(OR(Z17>10,Z17<0,Z18>10,Z18<0),\"Fehler\",IF(ABS(X17)-ABS(Y17)-(Z17+Z18)/2+10>0,IF(X17<0,-(ABS(X17)-ABS(Y17)-(Z17+Z18)/2+10),X17-ABS(Y17)-(Z17+Z18)/2+10),0)),0)","v":0},{"$f":"ABS(G17)+ABS(K17)+ABS(O17)+ABS(S17)+ABS(W17)+ABS(AA17)","v":0}]
[]
[null,{"$f":"IF(A19>0,B17,\"\")","v":""},{"$f":"IF(A19<>\"\", VLOOKUP(A19,'Wertungszettel M10'!A$7:B$36,2),\"\")","v":""},null,null,null,{"$f":"IF(AND(F19>0,F20>0),IF(OR(F19>10,F19<0,F20>10,F20<0),\"Fehler\",IF(ABS(D19)-ABS(E19)-(F19+F20)/2+10>0,IF(D19<0,-(ABS(D19)-ABS(E19)-(F19+F20)/2+10),D19-ABS(E19)-(F19+F20)/2+10),0)),0)","v":0},null,null,null,{"$f":"IF(AND(J19>0,J20>0),IF(OR(J19>10,J19<0,J20>10,J20<0),\"Fehler\",IF(ABS(H19)-ABS(I19)-(J19+J20)/2+10>0,IF(H19<0,-(ABS(H19)-ABS(I19)-(J19+J20)/2+10),H19-ABS(I19)-(J19+J20)/2+10),0)),0)","v":0},null,null,null,{"$f":"IF(AND(N19>0,N20>0),IF(OR(N19>10,N19<0,N20>10,N20<0),\"Fehler\",IF(ABS(L19)-ABS(M19)-(N19+N20)/2+10>0,IF(L19<0,-(ABS(L19)-ABS(M19)-(N19+N20)/2+10),L19-ABS(M19)-(N19+N20)/2+10),0)),0)","v":0},null,null,null,{"$f":"IF(AND(R19>0,R20>0),IF(OR(R19>10,R19<0,R20>10,R20<0),\"Fehler\",IF(ABS(P19)-ABS(Q19)-(R19+R20)/2+10>0,IF(P19<0,-(ABS(P19)-ABS(Q19)-(R19+R20)/2+10),P19-ABS(Q19)-(R19+R20)/2+10),0)),0)","v":0},null,null,null,{"$f":"IF(AND(V19>0,V20>0),IF(OR(V19>10,V19<0,V20>10,V20<0),\"Fehler\",IF(ABS(T19)-ABS(U19)-(V19+V20)/2+10>0,IF(T19<0,-(ABS(T19)-ABS(U19)-(V19+V20)/2+10),T19-ABS(U19)-(V19+V20)/2+10),0)),0)","v":0},null,null,null,{"$f":"IF(AND(Z19>0,Z20>0),IF(OR(Z19>10,Z19<0,Z20>10,Z20<0),\"Fehler\",IF(ABS(X19)-ABS(Y19)-(Z19+Z20)/2+10>0,IF(X19<0,-(ABS(X19)-ABS(Y19)-(Z19+Z20)/2+10),X19-ABS(Y19)-(Z19+Z20)/2+10),0)),0)","v":0},{"$f":"ABS(G19)+ABS(K19)+ABS(O19)+ABS(S19)+ABS(W19)+ABS(AA19)","v":0}]
[]
[null,{"$f":"IF(A21>0,B19,\"\")","v":""},{"$f":"IF(A21<>\"\", VLOOKUP(A21,'Wertungszettel M10'!A$7:B$36,2),\"\")","v":""},null,null,null,{"$f":"IF(AND(F21>0,F22>0),IF(OR(F21>10,F21<0,F22>10,F22<0),\"Fehler\",IF(ABS(D21)-ABS(E21)-(F21+F22)/2+10>0,IF(D21<0,-(ABS(D21)-ABS(E21)-(F21+F22)/2+10),D21-ABS(E21)-(F21+F22)/2+10),0)),0)","v":0},null,null,null,{"$f":"IF(AND(J21>0,J22>0),IF(OR(J21>10,J21<0,J22>10,J22<0),\"Fehler\",IF(ABS(H21)-ABS(I21)-(J21+J22)/2+10>0,IF(H21<0,-(ABS(H21)-ABS(I21)-(J21+J22)/2+10),H21-ABS(I21)-(J21+J22)/2+10),0)),0)","v":0},null,null,null,{"$f":"IF(AND(N21>0,N22>0),IF(OR(N21>10,N21<0,N22>10,N22<0),\"Fehler\",IF(ABS(L21)-ABS(M21)-(N21+N22)/2+10>0,IF(L21<0,-(ABS(L21)-ABS(M21)-(N21+N22)/2+10),L21-ABS(M21)-(N21+N22)/2+10),0)),0)","v":0},null,null,null,{"$f":"IF(AND(R21>0,R22>0),IF(OR(R21>10,R21<0,R22>10,R22<0),\"Fehler\",IF(ABS(P21)-ABS(Q21)-(R21+R22)/2+10>0,IF(P21<0,-(ABS(P21)-ABS(Q21)-(R21+R22)/2+10),P21-ABS(Q21)-(R21+R22)/2+10),0)),0)","v":0},null,null,null,{"$f":"IF(AND(V21>0,V22>0),IF(OR(V21>10,V21<0,V22>10,V22<0),\"Fehler\",IF(ABS(T21)-ABS(U21)-(V21+V22)/2+10>0,IF(T21<0,-(ABS(T21)-ABS(U21)-(V21+V22)/2+10),T21-ABS(U21)-(V21+V22)/2+10),0)),0)","v":0},null,null,null,{"$f":"IF(AND(Z21>0,Z22>0),IF(OR(Z21>10,Z21<0,Z22>10,Z22<0),\"Fehler\",IF(ABS(X21)-ABS(Y21)-(Z21+Z22)/2+10>0,IF(X21<0,-(ABS(X21)-ABS(Y21)-(Z21+Z22)/2+10),X21-ABS(Y21)-(Z21+Z22)/2+10),0)),0)","v":0},{"$f":"ABS(G21)+ABS(K21)+ABS(O21)+ABS(S21)+ABS(W21)+ABS(AA21)","v":0}]
[]
[null,{"$f":"IF(A23>0,B21,\"\")","v":""},{"$f":"IF(A23<>\"\", VLOOKUP(A23,'Wertungszettel M10'!A$7:B$36,2),\"\")","v":""},null,null,null,{"$f":"IF(AND(F23>0,F24>0),IF(OR(F23>10,F23<0,F24>10,F24<0),\"Fehler\",IF(ABS(D23)-ABS(E23)-(F23+F24)/2+10>0,IF(D23<0,-(ABS(D23)-ABS(E23)-(F23+F24)/2+10),D23-ABS(E23)-(F23+F24)/2+10),0)),0)","v":0},null,null,null,{"$f":"IF(AND(J23>0,J24>0),IF(OR(J23>10,J23<0,J24>10,J24<0),\"Fehler\",IF(ABS(H23)-ABS(I23)-(J23+J24)/2+10>0,IF(H23<0,-(ABS(H23)-ABS(I23)-(J23+J24)/2+10),H23-ABS(I23)-(J23+J24)/2+10),0)),0)","v":0},null,null,null,{"$f":"IF(AND(N23>0,N24>0),IF(OR(N23>10,N23<0,N24>10,N24<0),\"Fehler\",IF(ABS(L23)-ABS(M23)-(N23+N24)/2+10>0,IF(L23<0,-(ABS(L23)-ABS(M23)-(N23+N24)/2+10),L23-ABS(M23)-(N23+N24)/2+10),0)),0)","v":0},null,null,null,{"$f":"IF(AND(R23>0,R24>0),IF(OR(R23>10,R23<0,R24>10,R24<0),\"Fehler\",IF(ABS(P23)-ABS(Q23)-(R23+R24)/2+10>0,IF(P23<0,-(ABS(P23)-ABS(Q23)-(R23+R24)/2+10),P23-ABS(Q23)-(R23+R24)/2+10),0)),0)","v":0},null,null,null,{"$f":"IF(AND(V23>0,V24>0),IF(OR(V23>10,V23<0,V24>10,V24<0),\"Fehler\",IF(ABS(T23)-ABS(U23)-(V23+V24)/2+10>0,IF(T23<0,-(ABS(T23)-ABS(U23)-(V23+V24)/2+10),T23-ABS(U23)-(V23+V24)/2+10),0)),0)","v":0},null,null,null,{"$f":"IF(AND(Z23>0,Z24>0),IF(OR(Z23>10,Z23<0,Z24>10,Z24<0),\"Fehler\",IF(ABS(X23)-ABS(Y23)-(Z23+Z24)/2+10>0,IF(X23<0,-(ABS(X23)-ABS(Y23)-(Z23+Z24)/2+10),X23-ABS(Y23)-(Z23+Z24)/2+10),0)),0)","v":0},{"$f":"ABS(G23)+ABS(K23)+ABS(O23)+ABS(S23)+ABS(W23)+ABS(AA23)","v":0}]
[]
[null,{"$f":"IF(A25>0,B23,\"\")","v":""},{"$f":"IF(A25<>\"\", VLOOKUP(A25,'Wertungszettel M10'!A$7:B$36,2),\"\")","v":""},null,null,null,{"$f":"IF(AND(F25>0,F26>0),IF(OR(F25>10,F25<0,F26>10,F26<0),\"Fehler\",IF(ABS(D25)-ABS(E25)-(F25+F26)/2+10>0,IF(D25<0,-(ABS(D25)-ABS(E25)-(F25+F26)/2+10),D25-ABS(E25)-(F25+F26)/2+10),0)),0)","v":0},null,null,null,{"$f":"IF(AND(J25>0,J26>0),IF(OR(J25>10,J25<0,J26>10,J26<0),\"Fehler\",IF(ABS(H25)-ABS(I25)-(J25+J26)/2+10>0,IF(H25<0,-(ABS(H25)-ABS(I25)-(J25+J26)/2+10),H25-ABS(I25)-(J25+J26)/2+10),0)),0)","v":0},null,null,null,{"$f":"IF(AND(N25>0,N26>0),IF(OR(N25>10,N25<0,N26>10,N26<0),\"Fehler\",IF(ABS(L25)-ABS(M25)-(N25+N26)/2+10>0,IF(L25<0,-(ABS(L25)-ABS(M25)-(N25+N26)/2+10),L25-ABS(M25)-(N25+N26)/2+10),0)),0)","v":0},null,null,null,{"$f":"IF(AND(R25>0,R26>0),IF(OR(R25>10,R25<0,R26>10,R26<0),\"Fehler\",IF(ABS(P25)-ABS(Q25)-(R25+R26)/2+10>0,IF(P25<0,-(ABS(P25)-ABS(Q25)-(R25+R26)/2+10),P25-ABS(Q25)-(R25+R26)/2+10),0)),0)","v":0},null,null,null,{"$f":"IF(AND(V25>0,V26>0),IF(OR(V25>10,V25<0,V26>10,V26<0),\"Fehler\",IF(ABS(T25)-ABS(U25)-(V25+V26)/2+10>0,IF(T25<0,-(ABS(T25)-ABS(U25)-(V25+V26)/2+10),T25-ABS(U25)-(V25+V26)/2+10),0)),0)","v":0},null,null,null,{"$f":"IF(AND(Z25>0,Z26>0),IF(OR(Z25>10,Z25<0,Z26>10,Z26<0),\"Fehler\",IF(ABS(X25)-ABS(Y25)-(Z25+Z26)/2+10>0,IF(X25<0,-(ABS(X25)-ABS(Y25)-(Z25+Z26)/2+10),X25-ABS(Y25)-(Z25+Z26)/2+10),0)),0)","v":0},{"$f":"ABS(G25)+ABS(K25)+ABS(O25)+ABS(S25)+ABS(W25)+ABS(AA25)","v":0}]
[]
[null,{"$f":"IF(A27>0,B25,\"\")","v":""},{"$f":"IF(A27<>\"\", VLOOKUP(A27,'Wertungszettel M10'!A$7:B$36,2),\"\")","v":""},null,null,null,{"$f":"IF(AND(F27>0,F28>0),IF(OR(F27>10,F27<0,F28>10,F28<0),\"Fehler\",IF(ABS(D27)-ABS(E27)-(F27+F28)/2+10>0,IF(D27<0,-(ABS(D27)-ABS(E27)-(F27+F28)/2+10),D27-ABS(E27)-(F27+F28)/2+10),0)),0)","v":0},null,null,null,{"$f":"IF(AND(J27>0,J28>0),IF(OR(J27>10,J27<0,J28>10,J28<0),\"Fehler\",IF(ABS(H27)-ABS(I27)-(J27+J28)/2+10>0,IF(H27<0,-(ABS(H27)-ABS(I27)-(J27+J28)/2+10),H27-ABS(I27)-(J27+J28)/2+10),0)),0)","v":0},null,null,null,{"$f":"IF(AND(N27>0,N28>0),IF(OR(N27>10,N27<0,N28>10,N28<0),\"Fehler\",IF(ABS(L27)-ABS(M27)-(N27+N28)/2+10>0,IF(L27<0,-(ABS(L27)-ABS(M27)-(N27+N28)/2+10),L27-ABS(M27)-(N27+N28)/2+10),0)),0)","v":0},null,null,null,{"$f":"IF(AND(R27>0,R28>0),IF(OR(R27>10,R27<0,R28>10,R28<0),\"Fehler\",IF(ABS(P27)-ABS(Q27)-(R27+R28)/2+10>0,IF(P27<0,-(ABS(P27)-ABS(Q27)-(R27+R28)/2+10),P27-ABS(Q27)-(R27+R28)/2+10),0)),0)","v":0},null,null,null,{"$f":"IF(AND(V27>0,V28>0),IF(OR(V27>10,V27<0,V28>10,V28<0),\"Fehler\",IF(ABS(T27)-ABS(U27)-(V27+V28)/2+10>0,IF(T27<0,-(ABS(T27)-ABS(U27)-(V27+V28)/2+10),T27-ABS(U27)-(V27+V28)/2+10),0)),0)","v":0},null,null,null,{"$f":"IF(AND(Z27>0,Z28>0),IF(OR(Z27>10,Z27<0,Z28>10,Z28<0),\"Fehler\",IF(ABS(X27)-ABS(Y27)-(Z27+Z28)/2+10>0,IF(X27<0,-(ABS(X27)-ABS(Y27)-(Z27+Z28)/2+10),X27-ABS(Y27)-(Z27+Z28)/2+10),0)),0)","v":0},{"$f":"ABS(G27)+ABS(K27)+ABS(O27)+ABS(S27)+ABS(W27)+ABS(AA27)","v":0}]
[]
[]
[null,null,null,null,null,null,{"$f":"SUM(LARGE(G9:G28,1),LARGE(G9:G28,2),LARGE(G9:G28,3))","v":0},null,null,null,{"$f":"SUM(LARGE(K9:K28,1),LARGE(K9:K28,2),LARGE(K9:K28,3))","v":0},null,null,null,{"$f":"SUM(LARGE(O9:O28,1),LARGE(O9:O28,2),LARGE(O9:O28,3))","v":0},null,null,null,{"$f":"SUM(LARGE(S9:S28,1),LARGE(S9:S28,2),LARGE(S9:S28,3))","v":0},null,null,null,{"$f":"SUM(LARGE(W9:W28,1),LARGE(W9:W28,2),LARGE(W9:W28,3))","v":0},null,null,null,{"$f":"SUM(LARGE(AA9:AA28,1),LARGE(AA9:AA28,2),LARGE(AA9:AA28,3))","v":0},{"$f":"SUM(G30,K30,O30,S30,W30,AA30)","v":0}]

{"sheet":"Wertungszettel M1","index":14,"n_rows":200,"n_cols":6,"rows_kept":200,"cut":false,"hidden":false,"merged":[[197,0,198,0],[197,1,198,1],[197,2,198,2],[197,3,198,3],[197,5,198,5],[199,0,200,0],[199,1,200,1],[199,2,200,2],[199,3,200,3],[199,5,200,5],[193,0,194,0],[193,1,194,1],[193,2,194,2],[193,3,194,3],[193,5,194,5],[195,0,196,0],[195,1,196,1],[195,2,196,2],[195,3,196,3],[195,5,196,5],[189,0,190,0],[189,1,190,1],[189,2,190,2],[189,3,190,3],[189,5,190,5],[191,0,192,0],[191,1,192,1],[191,2,192,2],[191,3,192,3],[191,5,192,5],[185,0,186,0],[185,1,186,1],[185,2,186,2],[185,3,186,3],[185,5,186,5],[187,0,188,0],[187,1,188,1],[187,2,188,2],[187,3,188,3],[187,5,188,5],[181,0,182,0],[181,1,182,1],[181,2,182,2],[181,3,182,3],[181,5,182,5],[183,0,184,0],[183,1,184,1],[183,2,184,2],[183,3,184,3],[183,5,184,5],[177,0,178,0],[177,1,178,1],[177,2,178,2],[177,3,178,3],[177,5,178,5],[179,0,180,0],[179,1,180,1],[179,2,180,2],[179,3,180,3],[179,5,180,5],[173,0,174,0],[173,1,174,1],[173,2,174,2],[173,3,174,3],[173,5,174,5],[175,0,176,0],[175,1,176,1],[175,2,176,2],[175,3,176,3],[175,5,176,5],[166,0,167,0],[166,1,167,1],[166,2,167,2],[166,3,167,3],[166,5,167,5],[169,2,169,5],[171,0,172,0],[171,1,172,1],[171,2,172,2],[171,3,172,3],[171,5,172,5],[162,0,163,0],[162,1,163,1],[162,2,163,2],[162,3,163,3],[162,5,163,5],[164,0,165,0],[164,1,165,1],[164,2,165,2],[164,3,165,3],[164,5,165,5],[158,0,159,0],[158,1,159,1],[158,2,159,2],[158,3,159,3],[158,5,159,5],[160,0,161,0],[160,1,161,1],[160,2,161,2],[160,3,161,3],[160,5,161,5],[154,0,155,0],[154,1,155,1],[154,2,155,2],[154,3,155,3],[154,5,155,5],[156,0,157,0],[156,1,157,1],[156,2,157,2],[156,3,157,3],[156,5,157,5],[150,0,151,0],[150,1,151,1],[150,2,151,2],[150,3,151,3],[150,5,151,5],[152,0,153,0],[152,1,153,1],[152,2,153,2],[152,3,153,3],[152,5,153,5],[146,0,147,0],[146,1,147,1],[146,2,147,2],[146,3,147,3],[146,5,147,5],[148,0,149,0],[148,1,149,1],[148,2,149,2],[148,3,149,3],[148,5,149,5],[142,0,143,0],[142,1,143,1],[142,2,143,2],[142,3,143,3],[142,5,143,5],[144,0,145,0],[144,1,145,1],[144,2,145,2],[144,3,145,3],[144,5,145,5],[136,2,136,5],[138,0,139,0],[138,1,139,1],[138,2,139,2],[138,3,139,3],[138,5,139,5],[140,0,141,0],[140,1,141,1],[140,2,141,2],[140,3,141,3],[140,5,141,5],[131,0,132,0],[131,1,132,1],[131,2,132,2],[131,3,132,3],[131,5,132,5],[133,0,134,0],[133,1,134,1],[133,2,134,2],[133,3,134,3],[133,5,134,5],[127,0,128,0],[127,1,128,1],[127,2,128,2],[127,3,128,3],[127,5,128,5],[129,0,130,0],[129,1,130,1],[129,2,130,2],[129,3,130,3],[129,5,130,5],[123,0,124,0],[123,1,124,1],[123,2,124,2],[123,3,124,3],[123,5,124,5],[125,0,126,0],[125,1,126,1],[125,2,126,2],[125,3,126,3],[125,5,126,5],[119,0,120,0],[119,1,120,1],[119,2,120,2],[119,3,120,3],[119,5,120,5],[121,0,122,0],[121,1,122,1],[121,2,122,2],[121,3,122,3],[121,5,122,5],[115,0,116,0],[115,1,116,1],[115,2,116,2],[115,3,116,3],[115,5,116,5],[117,0,118,0],[117,1,118,1],[117,2,118,2],[117,3,118,3],[117,5,118,5],[111,0,112,0],[111,1,112,1],[111,2,112,2],[111,3,112,3],[111,5,112,5],[113,0,114,0],[113,1,114,1],[113,2,114,2],[113,3,114,3],[113,5,114,5],[107,0,108,0],[107,1,108,1],[107,2,108,2],[107,3,108,3],[107,5,108,5],[109,0,110,0],[109,1,110,1],[109,2,110,2],[109,3,110,3],[109,5,110,5],[100,0,101,0],[100,1,101,1],[100,2,101,2],[100,3,101,3],[100,5,101,5],[103,2,103,5],[105,0,106,0],[105,1,106,1],[105,2,106,2],[105,3,106,3],[105,5,106,5],[96,0,97,0],[96,1,97,1],[96,2,97,2],[96,3,97,3],[96,5,97,5],[98,0,99,0],[98,1,99,1],[98,2,99,2],[98,3,99,3],[98,5,99,5],[92,0,93,0],[92,1,93,1],[92,2,93,2],[92,3,93,3],[92,5,93,5],[94,0,95,0],[94,1,95,1],[94,2,95,2],[94,3,95,3],[94,5,95,5],[88,0,89,0],[88,1,89,1],[88,2,89,2],[88,3,89,3],[88,5,89,5],[90,0,91,0],[90,1,91,1],[90,2,91,2],[90,3,91,3],[90,5,91,5],[84,0,85,0],[84,1,85,1],[84,2,85,2],[84,3,85,3],[84,5,85,5],[86,0,87,0],[86,1,87,1],[86,2,87,2],[86,3,87,3],[86,5,87,5],[80,0,81,0],[80,1,81,1],[80,2,81,2],[80,3,81,3],[80,5,81,5],[82,0,83,0],[82,1,83,1],[82,2,83,2],[82,3,83,3],[82,5,83,5],[76,0,77,0],[76,1,77,1],[76,2,77,2],[76,3,77,3],[76,5,77,5],[78,0,79,0],[78,1,79,1],[78,2,79,2],[78,3,79,3],[78,5,79,5],[70,2,70,5],[72,0,73,0],[72,1,73,1],[72,2,73,2],[72,3,73,3],[72,5,73,5],[74,0,75,0],[74,1,75,1],[74,2,75,2],[74,3,75,3],[74,5,75,5],[67,0,68,0],[67,1,68,1],[67,2,68,2],[67,3,68,3],[67,5,68,5],[65,0,66,0],[65,1,66,1],[65,2,66,2],[65,3,66,3],[65,5,66,5],[63,0,64,0],[63,1,64,1],[63,2,64,2],[63,3,64,3],[63,5,64,5],[61,0,62,0],[61,1,62,1],[61,2,62,2],[61,3,62,3],[61,5,62,5],[59,0,60,0],[59,1,60,1],[59,2,60,2],[59,3,60,3],[59,5,60,5],[57,0,58,0],[57,1,58,1],[57,2,58,2],[57,3,58,3],[57,5,58,5],[55,0,56,0],[55,1,56,1],[55,2,56,2],[55,3,56,3],[55,5,56,5],[53,0,54,0],[53,1,54,1],[53,2,54,2],[53,3,54,3],[53,5,54,5],[51,0,52,0],[51,1,52,1],[51,2,52,2],[51,3,52,3],[51,5,52,5],[49,0,50,0],[49,1,50,1],[49,2,50,2],[49,3,50,3],[49,5,50,5],[47,0,48,0],[47,1,48,1],[47,2,48,2],[47,3,48,3],[47,5,48,5],[45,0,46,0],[45,1,46,1],[45,2,46,2],[45,3,46,3],[45,5,46,5],[43,0,44,0],[43,1,44,1],[43,2,44,2],[43,3,44,3],[43,5,44,5],[41,0,42,0],[41,1,42,1],[41,2,42,2],[41,3,42,3],[41,5,42,5],[24,5,25,5],[37,2,37,5],[39,0,40,0],[39,1,40,1],[39,2,40,2],[39,3,40,3],[39,5,40,5],[32,0,33,0],[32,1,33,1],[32,2,33,2],[32,3,33,3],[32,5,33,5],[34,0,35,0],[34,1,35,1],[34,2,35,2],[34,3,35,3],[34,5,35,5],[22,0,23,0],[22,1,23,1],[22,2,23,2],[22,3,23,3],[22,5,23,5],[30,0,31,0],[30,1,31,1],[30,2,31,2],[30,3,31,3],[30,5,31,5],[28,0,29,0],[28,1,29,1],[28,2,29,2],[28,3,29,3],[28,5,29,5],[26,0,27,0],[26,1,27,1],[26,2,27,2],[26,3,27,3],[26,5,27,5],[24,0,25,0],[24,1,25,1],[24,2,25,2],[24,3,25,3],[16,2,17,2],[16,3,17,3],[16,5,17,5],[14,2,15,2],[14,3,15,3],[14,5,15,5],[20,0,21,0],[20,1,21,1],[20,2,21,2],[20,3,21,3],[20,5,21,5],[18,0,19,0],[18,1,19,1],[18,2,19,2],[18,3,19,3],[18,5,19,5],[14,0,15,0],[14,1,15,1],[16,1,17,1],[16,0,17,0],[6,2,7,2],[6,3,7,3],[6,5,7,5],[4,2,4,5],[0,3,0,4],[1,3,1,4],[2,3,2,4],[12,0,13,0],[12,2,13,2],[12,3,13,3],[12,5,13,5],[8,2,9,2],[8,3,9,3],[8,5,9,5],[10,2,11,2],[10,3,11,3],[10,5,11,5],[8,0,9,0],[6,0,7,0],[10,0,11,0],[10,1,11,1],[12,1,13,1],[6,1,7,1],[8,1,9,1]]}
["Wettkampfbogen",null,"Ort / Datum :",{"$f":"'INFO Blatt'!B11","v":"Hehlen"},null,{"$f":"'INFO Blatt'!B13","v":"2019-02-16"}]
[null,null,"Mannschaft:",{"$f":"Formeln!A5","v":"MTV Boffzen e.V. von 1892"},null,"Wertungsvorschriften"]
[null,null,"Liga:",{"$f":"'INFO Blatt'!B7","v":"Einsteigerliga"},null,{"$f":"'INFO Blatt'!B5","v":"P und AK"}]
[]
["Name","Jg","Boden"]
[null,null,"D-Note","Abzug OK","E- Abzug","Note"]
["Tom Esau","11.03.2010"]
[]
["Thorge Haak","21.01.2010"]
[]
["Robin Meisner","12.07.2010"]
[]
["Nick Bernhardt","29.05.2009"]
[]
["Nico Schilcher","26.01.2009"]
[]
["Benedikt Sievers","12.02.2010"]
[]
["David Janzen","09.12.2008"]
[]
["Simon Janzen","07.07.2011"]
[]
["frei 9"]
[]
["frei 10"]
[]
["frei 11"]
[]
["frei 12"]
[]
["frei 13"]
[]
["frei 14"]
[]
["frei 15"]
[]
[]
["Name","Jg","Pauschenpferd"]
[null,null,"D-Note","Abzug OK","E- Abzug","Note"]
[{"$f":"IF(A7>0,A7,\"\")","v":"Tom Esau"},{"$f":"IF(B7>0,B7,\"\")","v":"11.03.2010"}]
[]
[{"$f":"IF(A9>0,A9,\"\")","v":"Thorge Haak"},"21.01.2010"]
[]
[{"$f":"IF(A11>0,A11,\"\")","v":"Robin Meisner"},"12.07.2010"]
[]
[{"$f":"IF(A13>0,A13,\"\")","v":"Nick Bernhardt"},"29.05.2009"]
[]
[{"$f":"IF(A15>0,A15,\"\")","v":"Nico Schilcher"},"26.01.2009"]
[]
[{"$f":"IF(A17>0,A17,\"\")","v":"Benedikt Sievers"},"12.02.2010"]
[]
[{"$f":"IF(A19>0,A19,\"\")","v":"David Janzen"},"09.12.2008"]
[]
[{"$f":"IF(A21>0,A21,\"\")","v":"Simon Janzen"},"07.07.2011"]
[]
[{"$f":"IF(A23>0,A23,\"\")","v":"frei 9"},""]
[]
[{"$f":"IF(A25>0,A25,\"\")","v":"frei 10"},""]
[]
[{"$f":"IF(A27>0,A27,\"\")","v":"frei 11"},""]
[]
[{"$f":"IF(A29>0,A29,\"\")","v":"frei 12"},""]
[]
[{"$f":"IF(A31>0,A31,\"\")","v":"frei 13"},""]
[]
[{"$f":"IF(A33>0,A33,\"\")","v":"frei 14"},""]
[]
[{"$f":"IF(A35>0,A35,\"\")","v":"frei 15"},""]
[]
[]
["Name","Jg","Ringe"]
[null,null,"D-Note","Abzug OK","E- Abzug","Note"]
[{"$f":"IF(A40>0,A40,\"\")","v":"Tom Esau"},{"$f":"IF(B40>0,B40,\"\")","v":"11.03.2010"}]
[]
[{"$f":"IF(A42>0,A42,\"\")","v":"Thorge Haak"},"21.01.2010"]
[]
[{"$f":"IF(A44>0,A44,\"\")","v":"Robin Meisner"},"12.07.2010"]
[]
[{"$f":"IF(A46>0,A46,\"\")","v":"Nick Bernhardt"},"29.05.2009"]
[]
[{"$f":"IF(A48>0,A48,\"\")","v":"Nico Schilcher"},"26.01.2009"]
[]
[{"$f":"IF(A50>0,A50,\"\")","v":"Benedikt Sievers"},"12.02.2010"]
[]
[{"$f":"IF(A52>0,A52,\"\")","v":"David Janzen"},"09.12.2008"]
[]
[{"$f":"IF(A54>0,A54,\"\")","v":"Simon Janzen"},"07.07.2011"]
[]
[{"$f":"IF(A56>0,A56,\"\")","v":"frei 9"},""]
[]
[{"$f":"IF(A58>0,A58,\"\")","v":"frei 10"},""]
[]
[{"$f":"IF(A60>0,A60,\"\")","v":"frei 11"},""]
[]
[{"$f":"IF(A62>0,A62,\"\")","v":"frei 12"},""]
[]
[{"$f":"IF(A64>0,A64,\"\")","v":"frei 13"},""]
[]
[{"$f":"IF(A66>0,A66,\"\")","v":"frei 14"},""]
[]
[{"$f":"IF(A68>0,A68,\"\")","v":"frei 15"},""]
[]
[]
["Name","Jg","Sprung"]
[null,null,"D-Note","Abzug OK","E- Abzug","Note"]
[{"$f":"IF(A73>0,A73,\"\")","v":"Tom Esau"},{"$f":"IF(B73>0,B73,\"\")","v":"11.03.2010"}]
[]
[{"$f":"IF(A75>0,A75,\"\")","v":"Thorge Haak"},"21.01.2010"]
[]
[{"$f":"IF(A77>0,A77,\"\")","v":"Robin Meisner"},"12.07.2010"]
[]
[{"$f":"IF(A79>0,A79,\"\")","v":"Nick Bernhardt"},"29.05.2009"]
[]
[{"$f":"IF(A81>0,A81,\"\")","v":"Nico Schilcher"},"26.01.2009"]
[]
[{"$f":"IF(A83>0,A83,\"\")","v":"Benedikt Sievers"},"12.02.2010"]
[]
[{"$f":"IF(A85>0,A85,\"\")","v":"David Janzen"},"09.12.2008"]
[]
[{"$f":"IF(A87>0,A87,\"\")","v":"Simon Janzen"},"07.07.2011"]
[]
[{"$f":"IF(A89>0,A89,\"\")","v":"frei 9"},""]
[]
[{"$f":"IF(A91>0,A91,\"\")","v":"frei 10"},""]
[]
[{"$f":"IF(A93>0,A93,\"\")","v":"frei 11"},""]
[]
[{"$f":"IF(A95>0,A95,\"\")","v":"frei 12"},""]
[]
[{"$f":"IF(A97>0,A97,\"\")","v":"frei 13"},""]
[]
[{"$f":"IF(A99>0,A99,\"\")","v":"frei 14"},""]
[]
[{"$f":"IF(A101>0,A101,\"\")","v":"frei 15"},""]
[]
[]
["Name","Jg","Barren"]
[null,null,"D-Note","Abzug OK","E- Abzug","Note"]
[{"$f":"IF(A106>0,A106,\"\")","v":"Tom Esau"},{"$f":"IF(B106>0,B106,\"\")","v":"11.03.2010"}]
[]
[{"$f":"IF(A108>0,A108,\"\")","v":"Thorge Haak"},"21.01.2010"]
[]
[{"$f":"IF(A110>0,A110,\"\")","v":"Robin Meisner"},"12.07.2010"]
[]
[{"$f":"IF(A112>0,A112,\"\")","v":"Nick Bernhardt"},"29.05.2009"]
[]
[{"$f":"IF(A114>0,A114,\"\")","v":"Nico Schilcher"},"26.01.2009"]
[]
[{"$f":"IF(A116>0,A116,\"\")","v":"Benedikt Sievers"},"12.02.2010"]
[]
[{"$f":"IF(A118>0,A118,\"\")","v":"David Janzen"},"09.12.2008"]
[]
[{"$f":"IF(A120>0,A120,\"\")","v":"Simon Janzen"},"07.07.2011"]
[]
[{"$f":"IF(A122>0,A122,\"\")","v":"frei 9"},""]
[]
[{"$f":"IF(A124>0,A124,\"\")","v":"frei 10"},""]
[]
[{"$f":"IF(A126>0,A126,\"\")","v":"frei 11"},""]
[]
[{"$f":"IF(A128>0,A128,\"\")","v":"frei 12"},""]
[]
[{"$f":"IF(A130>0,A130,\"\")","v":"frei 13"},""]
[]
[{"$f":"IF(A132>0,A132,\"\")","v":"frei 14"},""]
[]
[{"$f":"IF(A134>0,A134,\"\")","v":"frei 15"},""]
[]
[]
["Name","Jg","Reck"]
[null,null,"D-Note","Abzug OK","E- Abzug","Note"]
[{"$f":"IF(A139>0,A139,\"\")","v":"Tom Esau"},{"$f":"IF(B139>0,B139,\"\")","v":"11.03.2010"}]
[]
[{"$f":"IF(A141>0,A141,\"\")","v":"Thorge Haak"},"21.01.2010"]
[]
[{"$f":"IF(A143>0,A143,\"\")","v":"Robin Meisner"},"12.07.2010"]
[]
[{"$f":"IF(A145>0,A145,\"\")","v":"Nick Bernhardt"},"29.05.2009"]
[]
[{"$f":"IF(A147>0,A147,\"\")","v":"Nico Schilcher"},"26.01.2009"]
[]
[{"$f":"IF(A149>0,A149,\"\")","v":"Benedikt Sievers"},"12.02.2010"]
[]
[{"$f":"IF(A151>0,A151,\"\")","v":"David Janzen"},"09.12.2008"]
[]
[{"$f":"IF(A153>0,A153,\"\")","v":"Simon Janzen"},"07.07.2011"]
[]
[{"$f":"IF(A155>0,A155,\"\")","v":"frei 9"},""]
[]
[{"$f":"IF(A157>0,A157,\"\")","v":"frei 10"},""]
[]
[{"$f":"IF(A159>0,A159,\"\")","v":"frei 11"},""]
[]
[{"$f":"IF(A161>0,A161,\"\")","v":"frei 12"},""]
[]
[{"$f":"IF(A163>0,A163,\"\")","v":"frei 13"},""]
[]
[{"$f":"IF(A165>0,A165,\"\")","v":"frei 14"},""]
[]
[{"$f":"IF(A167>0,A167,\"\")","v":"frei 15"},""]

{"sheet":"Wertungszettel M2","index":15,"n_rows":200,"n_cols":6,"rows_kept":200,"cut":false,"hidden":false,"merged":[[0,3,0,4],[1,3,1,4],[2,3,2,4],[197,0,198,0],[197,1,198,1],[197,2,198,2],[197,3,198,3],[197,5,198,5],[199,0,200,0],[199,1,200,1],[199,2,200,2],[199,3,200,3],[199,5,200,5],[193,0,194,0],[193,1,194,1],[193,2,194,2],[193,3,194,3],[193,5,194,5],[195,0,196,0],[195,1,196,1],[195,2,196,2],[195,3,196,3],[195,5,196,5],[189,0,190,0],[189,1,190,1],[189,2,190,2],[189,3,190,3],[189,5,190,5],[191,0,192,0],[191,1,192,1],[191,2,192,2],[191,3,192,3],[191,5,192,5],[185,0,186,0],[185,1,186,1],[185,2,186,2],[185,3,186,3],[185,5,186,5],[187,0,188,0],[187,1,188,1],[187,2,188,2],[187,3,188,3],[187,5,188,5],[181,0,182,0],[181,1,182,1],[181,2,182,2],[181,3,182,3],[181,5,182,5],[183,0,184,0],[183,1,184,1],[183,2,184,2],[183,3,184,3],[183,5,184,5],[177,0,178,0],[177,1,178,1],[177,2,178,2],[177,3,178,3],[177,5,178,5],[179,0,180,0],[179,1,180,1],[179,2,180,2],[179,3,180,3],[179,5,180,5],[173,0,174,0],[173,1,174,1],[173,2,174,2],[173,3,174,3],[173,5,174,5],[175,0,176,0],[175,1,176,1],[175,2,176,2],[175,3,176,3],[175,5,176,5],[166,0,167,0],[166,1,167,1],[166,2,167,2],[166,3,167,3],[166,5,167,5],[169,2,169,5],[171,0,172,0],[171,1,172,1],[171,2,172,2],[171,3,172,3],[171,5,172,5],[162,0,163,0],[162,1,163,1],[162,2,163,2],[162,3,163,3],[162,5,163,5],[164,0,165,0],[164,1,165,1],[164,2,165,2],[164,3,165,3],[164,5,165,5],[158,0,159,0],[158,1,159,1],[158,2,159,2],[158,3,159,3],[158,5,159,5],[160,0,161,0],[160,1,161,1],[160,2,161,2],[160,3,161,3],[160,5,161,5],[154,0,155,0],[154,1,155,1],[154,2,155,2],[154,3,155,3],[154,5,155,5],[156,0,157,0],[156,1,157,1],[156,2,157,2],[156,3,157,3],[156,5,157,5],[150,0,151,0],[150,1,151,1],[150,2,151,2],[150,3,151,3],[150,5,151,5],[152,0,153,0],[152,1,153,1],[152,2,153,2],[152,3,153,3],[152,5,153,5],[146,0,147,0],[146,1,147,1],[146,2,147,2],[146,3,147,3],[146,5,147,5],[148,0,149,0],[148,1,149,1],[148,2,149,2],[148,3,149,3],[148,5,149,5],[142,0,143,0],[142,1,143,1],[142,2,143,2],[142,3,143,3],[142,5,143,5],[144,0,145,0],[144,1,145,1],[144,2,145,2],[144,3,145,3],[144,5,145,5],[136,2,136,5],[138,0,139,0],[138,1,139,1],[138,2,139,2],[138,3,139,3],[138,5,139,5],[140,0,141,0],[140,1,141,1],[140,2,141,2],[140,3,141,3],[140,5,141,5],[131,0,132,0],[131,1,132,1],[131,2,132,2],[131,3,132,3],[131,5,132,5],[133,0,134,0],[133,1,134,1],[133,2,134,2],[133,3,134,3],[133,5,134,5],[127,0,128,0],[127,1,128,1],[127,2,128,2],[127,3,128,3],[127,5,128,5],[129,0,130,0],[129,1,130,1],[129,2,130,2],[129,3,130,3],[129,5,130,5],[123,0,124,0],[123,1,124,1],[123,2,124,2],[123,3,124,3],[123,5,124,5],[125,0,126,0],[125,1,126,1],[125,2,126,2],[125,3,126,3],[125,5,126,5],[119,0,120,0],[119,1,120,1],[119,2,120,2],[119,3,120,3],[119,5,120,5],[121,0,122,0],[121,1,122,1],[121,2,122,2],[121,3,122,3],[121,5,122,5],[115,0,116,0],[115,1,116,1],[115,2,116,2],[115,3,116,3],[115,5,116,5],[117,0,118,0],[117,1,118,1],[117,2,118,2],[117,3,118,3],[117,5,118,5],[111,0,112,0],[111,1,112,1],[111,2,112,2],[111,3,112,3],[111,5,112,5],[113,0,114,0],[113,1,114,1],[113,2,114,2],[113,3,114,3],[113,5,114,5],[107,0,108,0],[107,1,108,1],[107,2,108,2],[107,3,108,3],[107,5,108,5],[109,0,110,0],[109,1,110,1],[109,2,110,2],[109,3,110,3],[109,5,110,5],[100,0,101,0],[100,1,101,1],[100,2,101,2],[100,3,101,3],[100,5,101,5],[103,2,103,5],[105,0,106,0],[105,1,106,1],[105,2,106,2],[105,3,106,3],[105,5,106,5],[96,0,97,0],[96,1,97,1],[96,2,97,2],[96,3,97,3],[96,5,97,5],[98,0,99,0],[98,1,99,1],[98,2,99,2],[98,3,99,3],[98,5,99,5],[92,0,93,0],[92,1,93,1],[92,2,93,2],[92,3,93,3],[92,5,93,5],[94,0,95,0],[94,1,95,1],[94,2,95,2],[94,3,95,3],[94,5,95,5],[88,0,89,0],[88,1,89,1],[88,2,89,2],[88,3,89,3],[88,5,89,5],[90,0,91,0],[90,1,91,1],[90,2,91,2],[90,3,91,3],[90,5,91,5],[84,0,85,0],[84,1,85,1],[84,2,85,2],[84,3,85,3],[84,5,85,5],[86,0,87,0],[86,1,87,1],[86,2,87,2],[86,3,87,3],[86,5,87,5],[80,0,81,0],[80,1,81,1],[80,2,81,2],[80,3,81,3],[80,5,81,5],[82,0,83,0],[82,1,83,1],[82,2,83,2],[82,3,83,3],[82,5,83,5],[76,0,77,0],[76,1,77,1],[76,2,77,2],[76,3,77,3],[76,5,77,5],[78,0,79,0],[78,1,79,1],[78,2,79,2],[78,3,79,3],[78,5,79,5],[70,2,70,5],[72,0,73,0],[72,1,73,1],[72,2,73,2],[72,3,73,3],[72,5,73,5],[74,0,75,0],[74,1,75,1],[74,2,75,2],[74,3,75,3],[74,5,75,5],[67,0,68,0],[67,1,68,1],[67,2,68,2],[67,3,68,3],[67,5,68,5],[65,0,66,0],[65,1,66,1],[65,2,66,2],[65,3,66,3],[65,5,66,5],[63,0,64,0],[63,1,64,1],[63,2,64,2],[63,3,64,3],[63,5,64,5],[61,0,62,0],[61,1,62,1],[61,2,62,2],[61,3,62,3],[61,5,62,5],[59,0,60,0],[59,1,60,1],[59,2,60,2],[59,3,60,3],[59,5,60,5],[57,0,58,0],[57,1,58,1],[57,2,58,2],[57,3,58,3],[57,5,58,5],[55,0,56,0],[55,1,56,1],[55,2,56,2],[55,3,56,3],[55,5,56,5],[53,0,54,0],[53,1,54,1],[53,2,54,2],[53,3,54,3],[53,5,54,5],[51,0,52,0],[51,1,52,1],[51,2,52,2],[51,3,52,3],[51,5,52,5],[49,0,50,0],[49,1,50,1],[49,2,50,2],[49,3,50,3],[49,5,50,5],[47,0,48,0],[47,1,48,1],[47,2,48,2],[47,3,48,3],[47,5,48,5],[45,0,46,0],[45,1,46,1],[45,2,46,2],[45,3,46,3],[45,5,46,5],[43,0,44,0],[43,1,44,1],[43,2,44,2],[43,3,44,3],[43,5,44,5],[41,0,42,0],[41,1,42,1],[41,2,42,2],[41,3,42,3],[41,5,42,5],[39,0,40,0],[39,1,40,1],[39,2,40,2],[39,3,40,3],[39,5,40,5],[37,2,37,5],[34,0,35,0],[34,1,35,1],[34,2,35,2],[34,3,35,3],[34,5,35,5],[32,0,33,0],[32,1,33,1],[32,2,33,2],[32,3,33,3],[32,5,33,5],[30,0,31,0],[30,1,31,1],[30,2,31,2],[30,3,31,3],[30,5,31,5],[28,0,29,0],[28,1,29,1],[28,2,29,2],[28,3,29,3],[28,5,29,5],[26,0,27,0],[26,1,27,1],[26,2,27,2],[26,3,27,3],[26,5,27,5],[24,0,25,0],[24,1,25,1],[24,2,25,2],[24,3,25,3],[24,5,25,5],[22,0,23,0],[22,1,23,1],[22,2,23,2],[22,3,23,3],[22,5,23,5],[20,0,21,0],[20,1,21,1],[20,2,21,2],[20,3,21,3],[20,5,21,5],[18,2,19,2],[18,3,19,3],[18,5,19,5],[18,0,19,0],[18,1,19,1],[16,2,17,2],[16,3,17,3],[16,5,17,5],[14,2,15,2],[14,3,15,3],[14,5,15,5],[16,1,17,1],[16,0,17,0],[14,0,15,0],[14,1,15,1],[12,2,13,2],[12,3,13,3],[12,5,13,5],[10,2,11,2],[10,3,11,3],[10,5,11,5],[12,1,13,1],[12,0,13,0],[10,0,11,0],[10,1,11,1],[4,2,4,5],[8,2,9,2],[8,3,9,3],[8,5,9,5],[6,2,7,2],[6,3,7,3],[6,5,7,5],[8,0,9,0],[6,0,7,0],[6,1,7,1],[8,1,9,1]]}
["Wettkampfbogen",null,"Ort / Datum :",{"$f":"'INFO Blatt'!B11","v":"Hehlen"},null,{"$f":"'INFO Blatt'!B13","v":"2019-02-16"}]
[null,null,"Mannschaft:",{"$f":"Formeln!A6","v":"TG Oker/Salzgitter/Wenzen"},null,"Wertungsvorschriften"]
[null,null,"Liga:",{"$f":"'INFO Blatt'!B7","v":"Einsteigerliga"},null,{"$f":"'INFO Blatt'!B5","v":"P und AK"}]
[]
["Name","Jg","Boden"]
[null,null,"D-Note","Abzug OK","E- Abzug","Note"]
["Ian Sureshkumar","2009"]
[]
["Rayan Hijazi","2009"]
[]
["Emmanuel König","2012"]
[]
["Linus Ankert","2009"]
[]
["Erik Pohler","2010"]
[]
["Mattis Westermann","2010"]
[]
["Felix Neuhoff","2011"]
[]
["frei 8"]
[]
["frei 9"]
[]
["frei 10"]
[]
["frei 11"]
[]
["frei 12"]
[]
["frei 13"]
[]
["frei 14"]
[]
["frei 15"]
[]
[]
["Name","Jg","Pauschenpferd"]
[null,null,"D-Note","Abzug OK","E- Abzug","Note"]
[{"$f":"IF(A7>0,A7,\"\")","v":"Ian Sureshkumar"},{"$f":"IF(B7>0,B7,\"\")","v":"2009"}]
[]
[{"$f":"IF(A9>0,A9,\"\")","v":"Rayan Hijazi"},{"$f":"IF(B9>0,B9,\"\")","v":"2009"}]
[]
[{"$f":"IF(A11>0,A11,\"\")","v":"Emmanuel König"},{"$f":"IF(B11>0,B11,\"\")","v":"2012"}]
[]
[{"$f":"IF(A13>0,A13,\"\")","v":"Linus Ankert"},{"$f":"IF(B13>0,B13,\"\")","v":"2009"}]
[]
[{"$f":"IF(A15>0,A15,\"\")","v":"Erik Pohler"},{"$f":"IF(B15>0,B15,\"\")","v":"2010"}]
[]
[{"$f":"IF(A17>0,A17,\"\")","v":"Mattis Westermann"},{"$f":"IF(B17>0,B17,\"\")","v":"2010"}]
[]
[{"$f":"IF(A19>0,A19,\"\")","v":"Felix Neuhoff"},{"$f":"IF(B19>0,B19,\"\")","v":"2011"}]
[]
[{"$f":"IF(A21>0,A21,\"\")","v":"frei 8"},{"$f":"IF(B21>0,B21,\"\")","v":""}]
[]
[{"$f":"IF(A23>0,A23,\"\")","v":"frei 9"},{"$f":"IF(B23>0,B23,\"\")","v":""}]
[]
[{"$f":"IF(A25>0,A25,\"\")","v":"frei 10"},{"$f":"IF(B25>0,B25,\"\")","v":""}]
[]
[{"$f":"IF(A27>0,A27,\"\")","v":"frei 11"},{"$f":"IF(B27>0,B27,\"\")","v":""}]
[]
[{"$f":"IF(A29>0,A29,\"\")","v":"frei 12"},{"$f":"IF(B29>0,B29,\"\")","v":""}]
[]
[{"$f":"IF(A31>0,A31,\"\")","v":"frei 13"},{"$f":"IF(B31>0,B31,\"\")","v":""}]
[]
[{"$f":"IF(A33>0,A33,\"\")","v":"frei 14"},""]
[]
[{"$f":"IF(A35>0,A35,\"\")","v":"frei 15"},""]
[]
[]
["Name","Jg","Ringe"]
[null,null,"D-Note","Abzug OK","E- Abzug","Note"]
[{"$f":"IF(A40>0,A40,\"\")","v":"Ian Sureshkumar"},{"$f":"IF(B40>0,B40,\"\")","v":"2009"}]
[]
[{"$f":"IF(A42>0,A42,\"\")","v":"Rayan Hijazi"},"2009"]
[]
[{"$f":"IF(A44>0,A44,\"\")","v":"Emmanuel König"},"2012"]
[]
[{"$f":"IF(A46>0,A46,\"\")","v":"Linus Ankert"},"2009"]
[]
[{"$f":"IF(A48>0,A48,\"\")","v":"Erik Pohler"},"2010"]
[]
[{"$f":"IF(A50>0,A50,\"\")","v":"Mattis Westermann"},"2010"]
[]
[{"$f":"IF(A52>0,A52,\"\")","v":"Felix Neuhoff"},"2011"]
[]
[{"$f":"IF(A54>0,A54,\"\")","v":"frei 8"},""]
[]
[{"$f":"IF(A56>0,A56,\"\")","v":"frei 9"},""]
[]
[{"$f":"IF(A58>0,A58,\"\")","v":"frei 10"},""]
[]
[{"$f":"IF(A60>0,A60,\"\")","v":"frei 11"},""]
[]
[{"$f":"IF(A62>0,A62,\"\")","v":"frei 12"},""]
[]
[{"$f":"IF(A64>0,A64,\"\")","v":"frei 13"},""]
[]
[{"$f":"IF(A66>0,A66,\"\")","v":"frei 14"},""]
[]
[{"$f":"IF(A68>0,A68,\"\")","v":"frei 15"},""]
[]
[]
["Name","Jg","Sprung"]
[null,null,"D-Note","Abzug OK","E- Abzug","Note"]
[{"$f":"IF(A73>0,A73,\"\")","v":"Ian Sureshkumar"},{"$f":"IF(B73>0,B73,\"\")","v":"2009"}]
[]
[{"$f":"IF(A75>0,A75,\"\")","v":"Rayan Hijazi"},"2009"]
[]
[{"$f":"IF(A77>0,A77,\"\")","v":"Emmanuel König"},"2012"]
[]
[{"$f":"IF(A79>0,A79,\"\")","v":"Linus Ankert"},"2009"]
[]
[{"$f":"IF(A81>0,A81,\"\")","v":"Erik Pohler"},"2010"]
[]
[{"$f":"IF(A83>0,A83,\"\")","v":"Mattis Westermann"},"2010"]
[]
[{"$f":"IF(A85>0,A85,\"\")","v":"Felix Neuhoff"},"2011"]
[]
[{"$f":"IF(A87>0,A87,\"\")","v":"frei 8"},""]
[]
[{"$f":"IF(A89>0,A89,\"\")","v":"frei 9"},""]
[]
[{"$f":"IF(A91>0,A91,\"\")","v":"frei 10"},""]
[]
[{"$f":"IF(A93>0,A93,\"\")","v":"frei 11"},""]
[]
[{"$f":"IF(A95>0,A95,\"\")","v":"frei 12"},""]
[]
[{"$f":"IF(A97>0,A97,\"\")","v":"frei 13"},""]
[]
[{"$f":"IF(A99>0,A99,\"\")","v":"frei 14"},""]
[]
[{"$f":"IF(A101>0,A101,\"\")","v":"frei 15"},""]
[]
[]
["Name","Jg","Barren"]
[null,null,"D-Note","Abzug OK","E- Abzug","Note"]
[{"$f":"IF(A106>0,A106,\"\")","v":"Ian Sureshkumar"},{"$f":"IF(B106>0,B106,\"\")","v":"2009"}]
[]
[{"$f":"IF(A108>0,A108,\"\")","v":"Rayan Hijazi"},"2009"]
[]
[{"$f":"IF(A110>0,A110,\"\")","v":"Emmanuel König"},"2012"]
[]
[{"$f":"IF(A112>0,A112,\"\")","v":"Linus Ankert"},"2009"]
[]
[{"$f":"IF(A114>0,A114,\"\")","v":"Erik Pohler"},"2010"]
[]
[{"$f":"IF(A116>0,A116,\"\")","v":"Mattis Westermann"},"2010"]
[]
[{"$f":"IF(A118>0,A118,\"\")","v":"Felix Neuhoff"},"2011"]
[]
[{"$f":"IF(A120>0,A120,\"\")","v":"frei 8"},""]
[]
[{"$f":"IF(A122>0,A122,\"\")","v":"frei 9"},""]
[]
[{"$f":"IF(A124>0,A124,\"\")","v":"frei 10"},""]
[]
[{"$f":"IF(A126>0,A126,\"\")","v":"frei 11"},""]
[]
[{"$f":"IF(A128>0,A128,\"\")","v":"frei 12"},""]
[]
[{"$f":"IF(A130>0,A130,\"\")","v":"frei 13"},""]
[]
[{"$f":"IF(A132>0,A132,\"\")","v":"frei 14"},""]
[]
[{"$f":"IF(A134>0,A134,\"\")","v":"frei 15"},""]
[]
[]
["Name","Jg","Reck"]
[null,null,"D-Note","Abzug OK","E- Abzug","Note"]
[{"$f":"IF(A139>0,A139,\"\")","v":"Ian Sureshkumar"},{"$f":"IF(B139>0,B139,\"\")","v":"2009"}]
[]
[{"$f":"IF(A141>0,A141,\"\")","v":"Rayan Hijazi"},"2009"]
[]
[{"$f":"IF(A143>0,A143,\"\")","v":"Emmanuel König"},"2012"]
[]
[{"$f":"IF(A145>0,A145,\"\")","v":"Linus Ankert"},"2009"]
[]
[{"$f":"IF(A147>0,A147,\"\")","v":"Erik Pohler"},"2010"]
[]
[{"$f":"IF(A149>0,A149,\"\")","v":"Mattis Westermann"},"2010"]
[]
[{"$f":"IF(A151>0,A151,\"\")","v":"Felix Neuhoff"},"2011"]
[]
[{"$f":"IF(A153>0,A153,\"\")","v":"frei 8"},""]
[]
[{"$f":"IF(A155>0,A155,\"\")","v":"frei 9"},""]
[]
[{"$f":"IF(A157>0,A157,\"\")","v":"frei 10"},""]
[]
[{"$f":"IF(A159>0,A159,\"\")","v":"frei 11"},""]
[]
[{"$f":"IF(A161>0,A161,\"\")","v":"frei 12"},""]
[]
[{"$f":"IF(A163>0,A163,\"\")","v":"frei 13"},""]
[]
[{"$f":"IF(A165>0,A165,\"\")","v":"frei 14"},""]
[]
[{"$f":"IF(A167>0,A167,\"\")","v":"frei 15"},""]

{"sheet":"Wertungszettel M3","index":16,"n_rows":200,"n_cols":6,"rows_kept":200,"cut":false,"hidden":false,"merged":[[0,3,0,4],[1,3,1,4],[2,3,2,4],[10,2,11,2],[10,3,11,3],[10,1,11,1],[6,1,7,1],[8,1,9,1],[197,0,198,0],[197,1,198,1],[197,2,198,2],[197,3,198,3],[189,0,190,0],[189,1,190,1],[189,2,190,2],[189,3,190,3],[181,0,182,0],[181,1,182,1],[181,2,182,2],[181,3,182,3],[173,0,174,0],[173,1,174,1],[173,2,174,2],[173,3,174,3],[197,5,198,5],[199,0,200,0],[199,1,200,1],[199,2,200,2],[199,3,200,3],[199,5,200,5],[193,0,194,0],[193,1,194,1],[193,2,194,2],[193,3,194,3],[193,5,194,5],[195,0,196,0],[195,1,196,1],[195,2,196,2],[195,3,196,3],[195,5,196,5],[189,5,190,5],[191,0,192,0],[191,1,192,1],[191,2,192,2],[191,3,192,3],[191,5,192,5],[185,0,186,0],[185,1,186,1],[185,2,186,2],[185,3,186,3],[185,5,186,5],[187,0,188,0],[187,1,188,1],[187,2,188,2],[187,3,188,3],[187,5,188,5],[181,5,182,5],[183,0,184,0],[183,1,184,1],[183,2,184,2],[183,3,184,3],[183,5,184,5],[177,0,178,0],[177,1,178,1],[177,2,178,2],[177,3,178,3],[177,5,178,5],[179,0,180,0],[179,1,180,1],[179,2,180,2],[179,3,180,3],[179,5,180,5],[173,5,174,5],[175,0,176,0],[175,1,176,1],[175,2,176,2],[175,3,176,3],[175,5,176,5],[166,0,167,0],[166,1,167,1],[166,2,167,2],[166,3,167,3],[166,5,167,5],[169,2,169,5],[171,0,172,0],[171,1,172,1],[171,2,172,2],[171,3,172,3],[171,5,172,5],[162,0,163,0],[162,1,163,1],[162,2,163,2],[162,3,163,3],[162,5,163,5],[164,0,165,0],[164,1,165,1],[164,2,165,2],[164,3,165,3],[164,5,165,5],[158,0,159,0],[158,1,159,1],[158,2,159,2],[158,3,159,3],[158,5,159,5],[160,0,161,0],[160,1,161,1],[160,2,161,2],[160,3,161,3],[160,5,161,5],[154,0,155,0],[154,1,155,1],[154,2,155,2],[154,3,155,3],[154,5,155,5],[156,0,157,0],[156,1,157,1],[156,2,157,2],[156,3,157,3],[156,5,157,5],[150,0,151,0],[150,1,151,1],[150,2,151,2],[150,3,151,3],[150,5,151,5],[152,0,153,0],[152,1,153,1],[152,2,153,2],[152,3,153,3],[152,5,153,5],[146,0,147,0],[146,1,147,1],[146,2,147,2],[146,3,147,3],[146,5,147,5],[148,0,149,0],[148,1,149,1],[148,2,149,2],[148,3,149,3],[148,5,149,5],[142,0,143,0],[142,1,143,1],[142,2,143,2],[142,3,143,3],[142,5,143,5],[144,0,145,0],[144,1,145,1],[144,2,145,2],[144,3,145,3],[144,5,145,5],[136,2,136,5],[138,0,139,0],[138,1,139,1],[138,2,139,2],[138,3,139,3],[138,5,139,5],[140,0,141,0],[140,1,141,1],[140,2,141,2],[140,3,141,3],[140,5,141,5],[131,0,132,0],[131,1,132,1],[131,2,132,2],[131,3,132,3],[131,5,132,5],[133,0,134,0],[133,1,134,1],[133,2,134,2],[133,3,134,3],[133,5,134,5],[127,0,128,0],[127,1,128,1],[127,2,128,2],[127,3,128,3],[127,5,128,5],[129,0,130,0],[129,1,130,1],[129,2,130,2],[129,3,130,3],[129,5,130,5],[123,0,124,0],[123,1,124,1],[123,2,124,2],[123,3,124,3],[123,5,124,5],[125,0,126,0],[125,1,126,1],[125,2,126,2],[125,3,126,3],[125,5,126,5],[119,0,120,0],[119,1,120,1],[119,2,120,2],[119,3,120,3],[119,5,120,5],[121,0,122,0],[121,1,122,1],[121,2,122,2],[121,3,122,3],[121,5,122,5],[115,0,116,0],[115,1,116,1],[115,2,116,2],[115,3,116,3],[115,5,116,5],[117,0,118,0],[117,1,118,1],[117,2,118,2],[117,3,118,3],[117,5,118,5],[111,0,112,0],[111,1,112,1],[111,2,112,2],[111,3,112,3],[111,5,112,5],[113,0,114,0],[113,1,114,1],[113,2,114,2],[113,3,114,3],[113,5,114,5],[107,0,108,0],[107,1,108,1],[107,2,108,2],[107,3,108,3],[107,5,108,5],[109,0,110,0],[109,1,110,1],[109,2,110,2],[109,3,110,3],[109,5,110,5],[100,0,101,0],[100,1,101,1],[100,2,101,2],[100,3,101,3],[100,5,101,5],[103,2,103,5],[105,0,106,0],[105,1,106,1],[105,2,106,2],[105,3,106,3],[105,5,106,5],[96,0,97,0],[96,1,97,1],[96,2,97,2],[96,3,97,3],[96,5,97,5],[98,0,99,0],[98,1,99,1],[98,2,99,2],[98,3,99,3],[98,5,99,5],[92,0,93,0],[92,1,93,1],[92,2,93,2],[92,3,93,3],[92,5,93,5],[94,0,95,0],[94,1,95,1],[94,2,95,2],[94,3,95,3],[94,5,95,5],[88,0,89,0],[88,1,89,1],[88,2,89,2],[88,3,89,3],[88,5,89,5],[90,0,91,0],[90,1,91,1],[90,2,91,2],[90,3,91,3],[90,5,91,5],[84,0,85,0],[84,1,85,1],[84,2,85,2],[84,3,85,3],[84,5,85,5],[86,0,87,0],[86,1,87,1],[86,2,87,2],[86,3,87,3],[86,5,87,5],[80,0,81,0],[80,1,81,1],[80,2,81,2],[80,3,81,3],[80,5,81,5],[82,0,83,0],[82,1,83,1],[82,2,83,2],[82,3,83,3],[82,5,83,5],[76,0,77,0],[76,1,77,1],[76,2,77,2],[76,3,77,3],[76,5,77,5],[78,0,79,0],[78,1,79,1],[78,2,79,2],[78,3,79,3],[78,5,79,5],[63,5,64,5],[65,0,66,0],[65,1,66,1],[65,2,66,2],[65,3,66,3],[65,5,66,5],[67,0,68,0],[67,1,68,1],[67,2,68,2],[67,3,68,3],[67,5,68,5],[74,0,75,0],[74,1,75,1],[74,2,75,2],[74,3,75,3],[74,5,75,5],[72,0,73,0],[72,1,73,1],[72,2,73,2],[72,3,73,3],[72,5,73,5],[37,2,37,5],[39,0,40,0],[39,1,40,1],[39,2,40,2],[39,3,40,3],[39,5,40,5],[70,2,70,5],[61,0,62,0],[61,1,62,1],[61,2,62,2],[61,3,62,3],[61,5,62,5],[63,0,64,0],[63,1,64,1],[63,2,64,2],[63,3,64,3],[57,0,58,0],[57,1,58,1],[57,2,58,2],[57,3,58,3],[57,5,58,5],[59,0,60,0],[59,1,60,1],[59,2,60,2],[59,3,60,3],[59,5,60,5],[53,0,54,0],[53,1,54,1],[53,2,54,2],[53,3,54,3],[53,5,54,5],[55,0,56,0],[55,1,56,1],[55,2,56,2],[55,3,56,3],[55,5,56,5],[49,0,50,0],[49,1,50,1],[49,2,50,2],[49,3,50,3],[49,5,50,5],[51,0,52,0],[51,1,52,1],[51,2,52,2],[51,3,52,3],[51,5,52,5],[45,0,46,0],[45,1,46,1],[45,2,46,2],[45,3,46,3],[45,5,46,5],[47,0,48,0],[47,1,48,1],[47,2,48,2],[47,3,48,3],[47,5,48,5],[41,0,42,0],[41,1,42,1],[41,2,42,2],[41,3,42,3],[41,5,42,5],[43,0,44,0],[43,1,44,1],[43,2,44,2],[43,3,44,3],[43,5,44,5],[34,0,35,0],[34,1,35,1],[34,2,35,2],[34,3,35,3],[34,5,35,5],[32,0,33,0],[32,1,33,1],[32,2,33,2],[32,3,33,3],[32,5,33,5],[30,0,31,0],[30,1,31,1],[30,2,31,2],[30,3,31,3],[30,5,31,5],[28,0,29,0],[28,1,29,1],[28,2,29,2],[28,3,29,3],[28,5,29,5],[26,0,27,0],[26,1,27,1],[26,2,27,2],[26,3,27,3],[26,5,27,5],[24,0,25,0],[24,1,25,1],[24,2,25,2],[24,3,25,3],[24,5,25,5],[22,0,23,0],[22,1,23,1],[22,2,23,2],[22,3,23,3],[22,5,23,5],[20,0,21,0],[20,2,21,2],[20,3,21,3],[20,5,21,5],[20,1,21,1],[18,2,19,2],[18,3,19,3],[18,5,19,5],[16,2,17,2],[16,3,17,3],[16,5,17,5],[18,0,19,0],[16,1,17,1],[18,1,19,1],[8,0,9,0],[6,0,7,0],[10,0,11,0],[12,0,13,0],[14,0,15,0],[16,0,17,0],[10,5,11,5],[4,2,4,5],[8,2,9,2],[8,3,9,3],[8,5,9,5],[6,2,7,2],[6,3,7,3],[6,5,7,5],[14,2,15,2],[14,3,15,3],[14,5,15,5],[12,2,13,2],[12,3,13,3],[12,5,13,5],[12,1,13,1],[14,1,15,1]]}
["Wettkampfbogen",null,"Ort / Datum :",{"$f":"'INFO Blatt'!B11","v":"Hehlen"},null,{"$f":"'INFO Blatt'!B13","v":"2019-02-16"}]
[null,null,"Mannschaft:",{"$f":"Formeln!A7","v":"TG LaPeKa"},null,"Wertungsvorschriften"]
[null,null,"Liga:",{"$f":"'INFO Blatt'!B7","v":"Einsteigerliga"},null,{"$f":"'INFO Blatt'!B5","v":"P und AK"}]
[]
["Name","Jg","Boden"]
[null,null,"D-Note","Abzug OK","E- Abzug","Note"]
["Lukas Sitzenstock"]
[]
["Til Mittag"]
[]
["Maxim Borgardt"]
[]
["Maxim Nuss"]
[]
["Bennett Hasenfuß"]
[]
["Jaroslaw Schwentner"]
[]
["frei 7"]
[]
["frei 8"]
[]
["frei 9"]
[]
["frei 10"]
[]
["frei 11"]
[]
["frei 12"]
[]
["frei 13"]
[]
["frei 14"]
[]
["frei 15"]
[]
[]
["Name","Jg","Pauschenpferd"]
[null,null,"D-Note","Abzug OK","E- Abzug","Note"]
[{"$f":"IF(A7>0,A7,\"\")","v":"Lukas Sitzenstock"},{"$f":"IF(B7>0,B7,\"\")","v":""}]
[]
[{"$f":"IF(A9>0,A9,\"\")","v":"Til Mittag"},""]
[]
[{"$f":"IF(A11>0,A11,\"\")","v":"Maxim Borgardt"},""]
[]
[{"$f":"IF(A13>0,A13,\"\")","v":"Maxim Nuss"},""]
[]
[{"$f":"IF(A15>0,A15,\"\")","v":"Bennett Hasenfuß"},""]
[]
[{"$f":"IF(A17>0,A17,\"\")","v":"Jaroslaw Schwentner"},""]
[]
[{"$f":"IF(A19>0,A19,\"\")","v":"frei 7"},""]
[]
[{"$f":"IF(A21>0,A21,\"\")","v":"frei 8"},""]
[]
[{"$f":"IF(A23>0,A23,\"\")","v":"frei 9"},""]
[]
[{"$f":"IF(A25>0,A25,\"\")","v":"frei 10"},""]
[]
[{"$f":"IF(A27>0,A27,\"\")","v":"frei 11"},""]
[]
[{"$f":"IF(A29>0,A29,\"\")","v":"frei 12"},""]
[]
[{"$f":"IF(A31>0,A31,\"\")","v":"frei 13"},""]
[]
[{"$f":"IF(A33>0,A33,\"\")","v":"frei 14"},""]
[]
[{"$f":"IF(A35>0,A35,\"\")","v":"frei 15"},""]
[]
[]
["Name","Jg","Ringe"]
[null,null,"D-Note","Abzug OK","E- Abzug","Note"]
[{"$f":"IF(A40>0,A40,\"\")","v":"Lukas Sitzenstock"},{"$f":"IF(B40>0,B40,\"\")","v":""}]
[]
[{"$f":"IF(A42>0,A42,\"\")","v":"Til Mittag"},""]
[]
[{"$f":"IF(A44>0,A44,\"\")","v":"Maxim Borgardt"},""]
[]
[{"$f":"IF(A46>0,A46,\"\")","v":"Maxim Nuss"},""]
[]
[{"$f":"IF(A48>0,A48,\"\")","v":"Bennett Hasenfuß"},""]
[]
[{"$f":"IF(A50>0,A50,\"\")","v":"Jaroslaw Schwentner"},""]
[]
[{"$f":"IF(A52>0,A52,\"\")","v":"frei 7"},""]
[]
[{"$f":"IF(A54>0,A54,\"\")","v":"frei 8"},""]
[]
[{"$f":"IF(A56>0,A56,\"\")","v":"frei 9"},""]
[]
[{"$f":"IF(A58>0,A58,\"\")","v":"frei 10"},""]
[]
[{"$f":"IF(A60>0,A60,\"\")","v":"frei 11"},""]
[]
[{"$f":"IF(A62>0,A62,\"\")","v":"frei 12"},""]
[]
[{"$f":"IF(A64>0,A64,\"\")","v":"frei 13"},""]
[]
[{"$f":"IF(A66>0,A66,\"\")","v":"frei 14"},""]
[]
[{"$f":"IF(A68>0,A68,\"\")","v":"frei 15"},""]
[]
[]
["Name","Jg","Sprung"]
[null,null,"D-Note","Abzug OK","E- Abzug","Note"]
[{"$f":"IF(A73>0,A73,\"\")","v":"Lukas Sitzenstock"},{"$f":"IF(B73>0,B73,\"\")","v":""}]
[]
[{"$f":"IF(A75>0,A75,\"\")","v":"Til Mittag"},""]
[]
[{"$f":"IF(A77>0,A77,\"\")","v":"Maxim Borgardt"},""]
[]
[{"$f":"IF(A79>0,A79,\"\")","v":"Maxim Nuss"},""]
[]
[{"$f":"IF(A81>0,A81,\"\")","v":"Bennett Hasenfuß"},""]
[]
[{"$f":"IF(A83>0,A83,\"\")","v":"Jaroslaw Schwentner"},""]
[]
[{"$f":"IF(A85>0,A85,\"\")","v":"frei 7"},""]
[]
[{"$f":"IF(A87>0,A87,\"\")","v":"frei 8"},""]
[]
[{"$f":"IF(A89>0,A89,\"\")","v":"frei 9"},""]
[]
[{"$f":"IF(A91>0,A91,\"\")","v":"frei 10"},""]
[]
[{"$f":"IF(A93>0,A93,\"\")","v":"frei 11"},""]
[]
[{"$f":"IF(A95>0,A95,\"\")","v":"frei 12"},""]
[]
[{"$f":"IF(A97>0,A97,\"\")","v":"frei 13"},""]
[]
[{"$f":"IF(A99>0,A99,\"\")","v":"frei 14"},""]
[]
[{"$f":"IF(A101>0,A101,\"\")","v":"frei 15"},""]
[]
[]
["Name","Jg","Barren"]
[null,null,"D-Note","Abzug OK","E- Abzug","Note"]
[{"$f":"IF(A106>0,A106,\"\")","v":"Lukas Sitzenstock"},{"$f":"IF(B106>0,B106,\"\")","v":""}]
[]
[{"$f":"IF(A108>0,A108,\"\")","v":"Til Mittag"},""]
[]
[{"$f":"IF(A110>0,A110,\"\")","v":"Maxim Borgardt"},""]
[]
[{"$f":"IF(A112>0,A112,\"\")","v":"Maxim Nuss"},""]
[]
[{"$f":"IF(A114>0,A114,\"\")","v":"Bennett Hasenfuß"},""]
[]
[{"$f":"IF(A116>0,A116,\"\")","v":"Jaroslaw Schwentner"},""]
[]
[{"$f":"IF(A118>0,A118,\"\")","v":"frei 7"},""]
[]
[{"$f":"IF(A120>0,A120,\"\")","v":"frei 8"},""]
[]
[{"$f":"IF(A122>0,A122,\"\")","v":"frei 9"},""]
[]
[{"$f":"IF(A124>0,A124,\"\")","v":"frei 10"},""]
[]
[{"$f":"IF(A126>0,A126,\"\")","v":"frei 11"},""]
[]
[{"$f":"IF(A128>0,A128,\"\")","v":"frei 12"},""]
[]
[{"$f":"IF(A130>0,A130,\"\")","v":"frei 13"},""]
[]
[{"$f":"IF(A132>0,A132,\"\")","v":"frei 14"},""]
[]
[{"$f":"IF(A134>0,A134,\"\")","v":"frei 15"},""]
[]
[]
["Name","Jg","Reck"]
[null,null,"D-Note","Abzug OK","E- Abzug","Note"]
[{"$f":"IF(A139>0,A139,\"\")","v":"Lukas Sitzenstock"},{"$f":"IF(B139>0,B139,\"\")","v":""}]
[]
[{"$f":"IF(A141>0,A141,\"\")","v":"Til Mittag"},""]
[]
[{"$f":"IF(A143>0,A143,\"\")","v":"Maxim Borgardt"},""]
[]
[{"$f":"IF(A145>0,A145,\"\")","v":"Maxim Nuss"},""]
[]
[{"$f":"IF(A147>0,A147,\"\")","v":"Bennett Hasenfuß"},""]
[]
[{"$f":"IF(A149>0,A149,\"\")","v":"Jaroslaw Schwentner"},""]
[]
[{"$f":"IF(A151>0,A151,\"\")","v":"frei 7"},""]
[]
[{"$f":"IF(A153>0,A153,\"\")","v":"frei 8"},""]
[]
[{"$f":"IF(A155>0,A155,\"\")","v":"frei 9"},""]
[]
[{"$f":"IF(A157>0,A157,\"\")","v":"frei 10"},""]
[]
[{"$f":"IF(A159>0,A159,\"\")","v":"frei 11"},""]
[]
[{"$f":"IF(A161>0,A161,\"\")","v":"frei 12"},""]
[]
[{"$f":"IF(A163>0,A163,\"\")","v":"frei 13"},""]
[]
[{"$f":"IF(A165>0,A165,\"\")","v":"frei 14"},""]
[]
[{"$f":"IF(A167>0,A167,\"\")","v":"frei 15"},""]

{"sheet":"Wertungszettel M4","index":17,"n_rows":200,"n_cols":6,"rows_kept":200,"cut":false,"hidden":false,"merged":[[0,3,0,4],[1,3,1,4],[2,3,2,4],[197,0,198,0],[197,1,198,1],[197,2,198,2],[197,3,198,3],[197,5,198,5],[199,0,200,0],[199,1,200,1],[199,2,200,2],[199,3,200,3],[199,5,200,5],[193,0,194,0],[193,1,194,1],[193,2,194,2],[193,3,194,3],[193,5,194,5],[195,0,196,0],[195,1,196,1],[195,2,196,2],[195,3,196,3],[195,5,196,5],[189,0,190,0],[189,1,190,1],[189,2,190,2],[189,3,190,3],[189,5,190,5],[191,0,192,0],[191,1,192,1],[191,2,192,2],[191,3,192,3],[191,5,192,5],[185,0,186,0],[185,1,186,1],[185,2,186,2],[185,3,186,3],[185,5,186,5],[187,0,188,0],[187,1,188,1],[187,2,188,2],[187,3,188,3],[187,5,188,5],[181,0,182,0],[181,1,182,1],[181,2,182,2],[181,3,182,3],[181,5,182,5],[183,0,184,0],[183,1,184,1],[183,2,184,2],[183,3,184,3],[183,5,184,5],[177,0,178,0],[177,1,178,1],[177,2,178,2],[177,3,178,3],[177,5,178,5],[179,0,180,0],[179,1,180,1],[179,2,180,2],[179,3,180,3],[179,5,180,5],[173,0,174,0],[173,1,174,1],[173,2,174,2],[173,3,174,3],[173,5,174,5],[175,0,176,0],[175,1,176,1],[175,2,176,2],[175,3,176,3],[175,5,176,5],[166,0,167,0],[166,1,167,1],[166,2,167,2],[166,3,167,3],[166,5,167,5],[169,2,169,5],[171,0,172,0],[171,1,172,1],[171,2,172,2],[171,3,172,3],[171,5,172,5],[162,0,163,0],[162,1,163,1],[162,2,163,2],[162,3,163,3],[162,5,163,5],[164,0,165,0],[164,1,165,1],[164,2,165,2],[164,3,165,3],[164,5,165,5],[158,0,159,0],[158,1,159,1],[158,2,159,2],[158,3,159,3],[158,5,159,5],[160,0,161,0],[160,1,161,1],[160,2,161,2],[160,3,161,3],[160,5,161,5],[154,0,155,0],[154,1,155,1],[154,2,155,2],[154,3,155,3],[154,5,155,5],[156,0,157,0],[156,1,157,1],[156,2,157,2],[156,3,157,3],[156,5,157,5],[150,0,151,0],[150,1,151,1],[150,2,151,2],[150,3,151,3],[150,5,151,5],[152,0,153,0],[152,1,153,1],[152,2,153,2],[152,3,153,3],[152,5,153,5],[146,0,147,0],[146,1,147,1],[146,2,147,2],[146,3,147,3],[146,5,147,5],[148,0,149,0],[148,1,149,1],[148,2,149,2],[148,3,149,3],[148,5,149,5],[142,0,143,0],[142,1,143,1],[142,2,143,2],[142,3,143,3],[142,5,143,5],[144,0,145,0],[144,1,145,1],[144,2,145,2],[144,3,145,3],[144,5,145,5],[136,2,136,5],[138,0,139,0],[138,1,139,1],[138,2,139,2],[138,3,139,3],[138,5,139,5],[140,0,141,0],[140,1,141,1],[140,2,141,2],[140,3,141,3],[140,5,141,5],[131,0,132,0],[131,1,132,1],[131,2,132,2],[131,3,132,3],[131,5,132,5],[133,0,134,0],[133,1,134,1],[133,2,134,2],[133,3,134,3],[133,5,134,5],[127,0,128,0],[127,1,128,1],[127,2,128,2],[127,3,128,3],[127,5,128,5],[129,0,130,0],[129,1,130,1],[129,2,130,2],[129,3,130,3],[129,5,130,5],[123,0,124,0],[123,1,124,1],[123,2,124,2],[123,3,124,3],[123,5,124,5],[125,0,126,0],[125,1,126,1],[125,2,126,2],[125,3,126,3],[125,5,126,5],[119,0,120,0],[119,1,120,1],[119,2,120,2],[119,3,120,3],[119,5,120,5],[121,0,122,0],[121,1,122,1],[121,2,122,2],[121,3,122,3],[121,5,122,5],[115,0,116,0],[115,1,116,1],[115,2,116,2],[115,3,116,3],[115,5,116,5],[117,0,118,0],[117,1,118,1],[117,2,118,2],[117,3,118,3],[117,5,118,5],[111,0,112,0],[111,1,112,1],[111,2,112,2],[111,3,112,3],[111,5,112,5],[113,0,114,0],[113,1,114,1],[113,2,114,2],[113,3,114,3],[113,5,114,5],[107,0,108,0],[107,1,108,1],[107,2,108,2],[107,3,108,3],[107,5,108,5],[109,0,110,0],[109,1,110,1],[109,2,110,2],[109,3,110,3],[109,5,110,5],[100,0,101,0],[100,1,101,1],[100,2,101,2],[100,3,101,3],[100,5,101,5],[103,2,103,5],[105,0,106,0],[105,1,106,1],[105,2,106,2],[105,3,106,3],[105,5,106,5],[96,0,97,0],[96,1,97,1],[96,2,97,2],[96,3,97,3],[96,5,97,5],[98,0,99,0],[98,1,99,1],[98,2,99,2],[98,3,99,3],[98,5,99,5],[92,0,93,0],[92,1,93,1],[92,2,93,2],[92,3,93,3],[92,5,93,5],[94,0,95,0],[94,1,95,1],[94,2,95,2],[94,3,95,3],[94,5,95,5],[88,0,89,0],[88,1,89,1],[88,2,89,2],[88,3,89,3],[88,5,89,5],[90,0,91,0],[90,1,91,1],[90,2,91,2],[90,3,91,3],[90,5,91,5],[84,0,85,0],[84,1,85,1],[84,2,85,2],[84,3,85,3],[84,5,85,5],[86,0,87,0],[86,1,87,1],[86,2,87,2],[86,3,87,3],[86,5,87,5],[80,0,81,0],[80,1,81,1],[80,2,81,2],[80,3,81,3],[80,5,81,5],[82,0,83,0],[82,1,83,1],[82,2,83,2],[82,3,83,3],[82,5,83,5],[76,0,77,0],[76,1,77,1],[76,2,77,2],[76,3,77,3],[76,5,77,5],[78,0,79,0],[78,1,79,1],[78,2,79,2],[78,3,79,3],[78,5,79,5],[70,2,70,5],[72,0,73,0],[72,1,73,1],[72,2,73,2],[72,3,73,3],[72,5,73,5],[74,0,75,0],[74,1,75,1],[74,2,75,2],[74,3,75,3],[74,5,75,5],[67,0,68,0],[67,1,68,1],[67,2,68,2],[67,3,68,3],[67,5,68,5],[65,0,66,0],[65,1,66,1],[65,2,66,2],[65,3,66,3],[65,5,66,5],[63,0,64,0],[63,1,64,1],[63,2,64,2],[63,3,64,3],[63,5,64,5],[61,0,62,0],[61,1,62,1],[61,2,62,2],[61,3,62,3],[61,5,62,5],[59,0,60,0],[59,1,60,1],[59,2,60,2],[59,3,60,3],[59,5,60,5],[57,0,58,0],[57,1,58,1],[57,2,58,2],[57,3,58,3],[57,5,58,5],[55,0,56,0],[55,1,56,1],[55,2,56,2],[55,3,56,3],[55,5,56,5],[53,0,54,0],[53,1,54,1],[53,2,54,2],[53,3,54,3],[53,5,54,5],[51,0,52,0],[51,1,52,1],[51,2,52,2],[51,3,52,3],[51,5,52,5],[49,0,50,0],[49,1,50,1],[49,2,50,2],[49,3,50,3],[49,5,50,5],[47,0,48,0],[47,1,48,1],[47,2,48,2],[47,3,48,3],[47,5,48,5],[45,0,46,0],[45,1,46,1],[45,2,46,2],[45,3,46,3],[45,5,46,5],[43,0,44,0],[43,1,44,1],[43,2,44,2],[43,3,44,3],[43,5,44,5],[41,0,42,0],[41,1,42,1],[41,2,42,2],[41,3,42,3],[41,5,42,5],[39,0,40,0],[39,1,40,1],[39,2,40,2],[39,3,40,3],[39,5,40,5],[37,2,37,5],[34,0,35,0],[34,1,35,1],[34,2,35,2],[34,3,35,3],[34,5,35,5],[32,0,33,0],[32,1,33,1],[32,2,33,2],[32,3,33,3],[32,5,33,5],[30,0,31,0],[30,1,31,1],[30,2,31,2],[30,3,31,3],[30,5,31,5],[28,0,29,0],[28,1,29,1],[28,2,29,2],[28,3,29,3],[28,5,29,5],[26,0,27,0],[26,1,27,1],[26,2,27,2],[26,3,27,3],[26,5,27,5],[24,0,25,0],[24,1,25,1],[24,2,25,2],[24,3,25,3],[24,5,25,5],[22,0,23,0],[22,1,23,1],[22,2,23,2],[22,3,23,3],[22,5,23,5],[20,0,21,0],[20,1,21,1],[20,2,21,2],[20,3,21,3],[20,5,21,5],[18,0,19,0],[18,1,19,1],[18,2,19,2],[18,3,19,3],[18,5,19,5],[16,2,17,2],[16,3,17,3],[16,5,17,5],[14,0,15,0],[14,1,15,1],[14,2,15,2],[14,3,15,3],[14,5,15,5],[12,0,13,0],[12,1,13,1],[12,2,13,2],[12,3,13,3],[12,5,13,5],[16,0,17,0],[16,1,17,1],[10,0,11,0],[10,1,11,1],[10,2,11,2],[10,3,11,3],[10,5,11,5],[4,2,4,5],[8,0,9,0],[8,1,9,1],[8,2,9,2],[8,3,9,3],[8,5,9,5],[6,0,7,0],[6,1,7,1],[6,2,7,2],[6,3,7,3],[6,5,7,5]]}
["Wettkampfbogen",null,"Ort / Datum :",{"$f":"'INFO Blatt'!B11","v":"Hehlen"},null,{"$f":"'INFO Blatt'!B13","v":"2019-02-16"}]
[null,null,"Mannschaft:",{"$f":"Formeln!A8","v":"TSV Dielmissen"},null,"Wertungsvorschriften"]
[null,null,"Liga:",{"$f":"'INFO Blatt'!B7","v":"Einsteigerliga"},null,{"$f":"'INFO Blatt'!B5","v":"P und AK"}]
[]
["Name","Jg","Boden"]
[null,null,"D-Note","Abzug OK","E- Abzug","Note"]
["Sebastian Bocian","2009"]
[]
["Yannick Schröder","2009"]
[]
["Tristan Warmuth","2010"]
[]
["Leon Nolte-Furchner","2011"]
[]
["Joel Holzkamp","2011"]
[]
["frei 6"]
[]
["frei 7"]
[]
["frei 8"]
[]
["frei 9"]
[]
["frei 10"]
[]
["frei 11"]
[]
["frei 12"]
[]
["frei 13"]
[]
["frei 14"]
[]
["frei 15"]
[]
[]
["Name","Jg","Pauschenpferd"]
[null,null,"D-Note","Abzug OK","E- Abzug","Note"]
[{"$f":"IF(A7>0,A7,\"\")","v":"Sebastian Bocian"},{"$f":"IF(B7>0,B7,\"\")","v":"2009"}]
[]
[{"$f":"IF(A9>0,A9,\"\")","v":"Yannick Schröder"},"2009"]
[]
[{"$f":"IF(A11>0,A11,\"\")","v":"Tristan Warmuth"},"2010"]
[]
[{"$f":"IF(A13>0,A13,\"\")","v":"Leon Nolte-Furchner"},"2011"]
[]
[{"$f":"IF(A15>0,A15,\"\")","v":"Joel Holzkamp"},"2011"]
[]
[{"$f":"IF(A18>0,A18,\"\")","v":""},{"$f":"IF(B17>0,B17,\"\")","v":""}]
[]
[{"$f":"IF(A19>0,A19,\"\")","v":"frei 7"},""]
[]
[{"$f":"IF(A21>0,A21,\"\")","v":"frei 8"},""]
[]
[{"$f":"IF(A23>0,A23,\"\")","v":"frei 9"},""]
[]
[{"$f":"IF(A25>0,A25,\"\")","v":"frei 10"},""]
[]
[{"$f":"IF(A27>0,A27,\"\")","v":"frei 11"},""]
[]
[{"$f":"IF(A29>0,A29,\"\")","v":"frei 12"},""]
[]
[{"$f":"IF(A31>0,A31,\"\")","v":"frei 13"},""]
[]
[{"$f":"IF(A33>0,A33,\"\")","v":"frei 14"},""]
[]
[{"$f":"IF(A35>0,A35,\"\")","v":"frei 15"},""]
[]
[]
["Name","Jg","Ringe"]
[null,null,"D-Note","Abzug OK","E- Abzug","Note"]
[{"$f":"IF(A40>0,A40,\"\")","v":"Sebastian Bocian"},{"$f":"IF(B40>0,B40,\"\")","v":"2009"}]
[]
[{"$f":"IF(A42>0,A42,\"\")","v":"Yannick Schröder"},"2009"]
[]
[{"$f":"IF(A44>0,A44,\"\")","v":"Tristan Warmuth"},"2010"]
[]
[{"$f":"IF(A46>0,A46,\"\")","v":"Leon Nolte-Furchner"},"2011"]
[]
[{"$f":"IF(A48>0,A48,\"\")","v":"Joel Holzkamp"},"2011"]
[]
[{"$f":"IF(A50>0,A50,\"\")","v":""},""]
[]
[{"$f":"IF(A52>0,A52,\"\")","v":"frei 7"},""]
[]
[{"$f":"IF(A54>0,A54,\"\")","v":"frei 8"},""]
[]
[{"$f":"IF(A56>0,A56,\"\")","v":"frei 9"},""]
[]
[{"$f":"IF(A58>0,A58,\"\")","v":"frei 10"},""]
[]
[{"$f":"IF(A60>0,A60,\"\")","v":"frei 11"},""]
[]
[{"$f":"IF(A62>0,A62,\"\")","v":"frei 12"},""]
[]
[{"$f":"IF(A64>0,A64,\"\")","v":"frei 13"},""]
[]
[{"$f":"IF(A66>0,A66,\"\")","v":"frei 14"},""]
[]
[{"$f":"IF(A68>0,A68,\"\")","v":"frei 15"},""]
[]
[]
["Name","Jg","Sprung"]
[null,null,"D-Note","Abzug OK","E- Abzug","Note"]
[{"$f":"IF(A73>0,A73,\"\")","v":"Sebastian Bocian"},{"$f":"IF(B73>0,B73,\"\")","v":"2009"}]
[]
[{"$f":"IF(A75>0,A75,\"\")","v":"Yannick Schröder"},"2009"]
[]
[{"$f":"IF(A77>0,A77,\"\")","v":"Tristan Warmuth"},"2010"]
[]
[{"$f":"IF(A79>0,A79,\"\")","v":"Leon Nolte-Furchner"},"2011"]
[]
[{"$f":"IF(A81>0,A81,\"\")","v":"Joel Holzkamp"},"2011"]
[]
[{"$f":"IF(A83>0,A83,\"\")","v":""},""]
[]
[{"$f":"IF(A85>0,A85,\"\")","v":"frei 7"},""]
[]
[{"$f":"IF(A87>0,A87,\"\")","v":"frei 8"},""]
[]
[{"$f":"IF(A89>0,A89,\"\")","v":"frei 9"},""]
[]
[{"$f":"IF(A91>0,A91,\"\")","v":"frei 10"},""]
[]
[{"$f":"IF(A93>0,A93,\"\")","v":"frei 11"},""]
[]
[{"$f":"IF(A95>0,A95,\"\")","v":"frei 12"},""]
[]
[{"$f":"IF(A97>0,A97,\"\")","v":"frei 13"},""]
[]
[{"$f":"IF(A99>0,A99,\"\")","v":"frei 14"},""]
[]
[{"$f":"IF(A101>0,A101,\"\")","v":"frei 15"},""]
[]
[]
["Name","Jg","Barren"]
[null,null,"D-Note","Abzug OK","E- Abzug","Note"]
[{"$f":"IF(A106>0,A106,\"\")","v":"Sebastian Bocian"},{"$f":"IF(B106>0,B106,\"\")","v":"2009"}]
[]
[{"$f":"IF(A108>0,A108,\"\")","v":"Yannick Schröder"},"2009"]
[]
[{"$f":"IF(A110>0,A110,\"\")","v":"Tristan Warmuth"},"2010"]
[]
[{"$f":"IF(A112>0,A112,\"\")","v":"Leon Nolte-Furchner"},"2011"]
[]
[{"$f":"IF(A114>0,A114,\"\")","v":"Joel Holzkamp"},"2011"]
[]
[{"$f":"IF(A116>0,A116,\"\")","v":""},""]
[]
[{"$f":"IF(A118>0,A118,\"\")","v":"frei 7"},""]
[]
[{"$f":"IF(A120>0,A120,\"\")","v":"frei 8"},""]
[]
[{"$f":"IF(A122>0,A122,\"\")","v":"frei 9"},""]
[]
[{"$f":"IF(A124>0,A124,\"\")","v":"frei 10"},""]
[]
[{"$f":"IF(A126>0,A126,\"\")","v":"frei 11"},""]
[]
[{"$f":"IF(A128>0,A128,\"\")","v":"frei 12"},""]
[]
[{"$f":"IF(A130>0,A130,\"\")","v":"frei 13"},""]
[]
[{"$f":"IF(A132>0,A132,\"\")","v":"frei 14"},""]
[]
[{"$f":"IF(A134>0,A134,\"\")","v":"frei 15"},""]
[]
[]
["Name","Jg","Reck"]
[null,null,"D-Note","Abzug OK","E- Abzug","Note"]
[{"$f":"IF(A139>0,A139,\"\")","v":"Sebastian Bocian"},{"$f":"IF(B139>0,B139,\"\")","v":"2009"}]
[]
[{"$f":"IF(A141>0,A141,\"\")","v":"Yannick Schröder"},"2009"]
[]
[{"$f":"IF(A143>0,A143,\"\")","v":"Tristan Warmuth"},"2010"]
[]
[{"$f":"IF(A145>0,A145,\"\")","v":"Leon Nolte-Furchner"},"2011"]
[]
[{"$f":"IF(A147>0,A147,\"\")","v":"Joel Holzkamp"},"2011"]
[]
[{"$f":"IF(A149>0,A149,\"\")","v":""},""]
[]
[{"$f":"IF(A151>0,A151,\"\")","v":"frei 7"},""]
[]
[{"$f":"IF(A153>0,A153,\"\")","v":"frei 8"},""]
[]
[{"$f":"IF(A155>0,A155,\"\")","v":"frei 9"},""]
[]
[{"$f":"IF(A157>0,A157,\"\")","v":"frei 10"},""]
[]
[{"$f":"IF(A159>0,A159,\"\")","v":"frei 11"},""]
[]
[{"$f":"IF(A161>0,A161,\"\")","v":"frei 12"},""]
[]
[{"$f":"IF(A163>0,A163,\"\")","v":"frei 13"},""]
[]
[{"$f":"IF(A165>0,A165,\"\")","v":"frei 14"},""]
[]
[{"$f":"IF(A167>0,A167,\"\")","v":"frei 15"},""]

{"sheet":"Wertungszettel M5","index":18,"n_rows":200,"n_cols":6,"rows_kept":200,"cut":false,"hidden":false,"merged":[[0,3,0,4],[1,3,1,4],[2,3,2,4],[197,0,198,0],[197,1,198,1],[197,2,198,2],[197,3,198,3],[197,5,198,5],[199,0,200,0],[199,1,200,1],[199,2,200,2],[199,3,200,3],[199,5,200,5],[193,0,194,0],[193,1,194,1],[193,2,194,2],[193,3,194,3],[193,5,194,5],[195,0,196,0],[195,1,196,1],[195,2,196,2],[195,3,196,3],[195,5,196,5],[189,0,190,0],[189,1,190,1],[189,2,190,2],[189,3,190,3],[189,5,190,5],[191,0,192,0],[191,1,192,1],[191,2,192,2],[191,3,192,3],[191,5,192,5],[185,0,186,0],[185,1,186,1],[185,2,186,2],[185,3,186,3],[185,5,186,5],[187,0,188,0],[187,1,188,1],[187,2,188,2],[187,3,188,3],[187,5,188,5],[181,0,182,0],[181,1,182,1],[181,2,182,2],[181,3,182,3],[181,5,182,5],[183,0,184,0],[183,1,184,1],[183,2,184,2],[183,3,184,3],[183,5,184,5],[177,0,178,0],[177,1,178,1],[177,2,178,2],[177,3,178,3],[177,5,178,5],[179,0,180,0],[179,1,180,1],[179,2,180,2],[179,3,180,3],[179,5,180,5],[173,0,174,0],[173,1,174,1],[173,2,174,2],[173,3,174,3],[173,5,174,5],[175,0,176,0],[175,1,176,1],[175,2,176,2],[175,3,176,3],[175,5,176,5],[166,0,167,0],[166,1,167,1],[166,2,167,2],[166,3,167,3],[166,5,167,5],[169,2,169,5],[171,0,172,0],[171,1,172,1],[171,2,172,2],[171,3,172,3],[171,5,172,5],[162,0,163,0],[162,1,163,1],[162,2,163,2],[162,3,163,3],[162,5,163,5],[164,0,165,0],[164,1,165,1],[164,2,165,2],[164,3,165,3],[164,5,165,5],[158,0,159,0],[158,1,159,1],[158,2,159,2],[158,3,159,3],[158,5,159,5],[160,0,161,0],[160,1,161,1],[160,2,161,2],[160,3,161,3],[160,5,161,5],[154,0,155,0],[154,1,155,1],[154,2,155,2],[154,3,155,3],[154,5,155,5],[156,0,157,0],[156,1,157,1],[156,2,157,2],[156,3,157,3],[156,5,157,5],[150,0,151,0],[150,1,151,1],[150,2,151,2],[150,3,151,3],[150,5,151,5],[152,0,153,0],[152,1,153,1],[152,2,153,2],[152,3,153,3],[152,5,153,5],[146,0,147,0],[146,1,147,1],[146,2,147,2],[146,3,147,3],[146,5,147,5],[148,0,149,0],[148,1,149,1],[148,2,149,2],[148,3,149,3],[148,5,149,5],[142,0,143,0],[142,1,143,1],[142,2,143,2],[142,3,143,3],[142,5,143,5],[144,0,145,0],[144,1,145,1],[144,2,145,2],[144,3,145,3],[144,5,145,5],[136,2,136,5],[138,0,139,0],[138,1,139,1],[138,2,139,2],[138,3,139,3],[138,5,139,5],[140,0,141,0],[140,1,141,1],[140,2,141,2],[140,3,141,3],[140,5,141,5],[131,0,132,0],[131,1,132,1],[131,2,132,2],[131,3,132,3],[131,5,132,5],[133,0,134,0],[133,1,134,1],[133,2,134,2],[133,3,134,3],[133,5,134,5],[127,0,128,0],[127,1,128,1],[127,2,128,2],[127,3,128,3],[127,5,128,5],[129,0,130,0],[129,1,130,1],[129,2,130,2],[129,3,130,3],[129,5,130,5],[123,0,124,0],[123,1,124,1],[123,2,124,2],[123,3,124,3],[123,5,124,5],[125,0,126,0],[125,1,126,1],[125,2,126,2],[125,3,126,3],[125,5,126,5],[119,0,120,0],[119,1,120,1],[119,2,120,2],[119,3,120,3],[119,5,120,5],[121,0,122,0],[121,1,122,1],[121,2,122,2],[121,3,122,3],[121,5,122,5],[115,0,116,0],[115,1,116,1],[115,2,116,2],[115,3,116,3],[115,5,116,5],[117,0,118,0],[117,1,118,1],[117,2,118,2],[117,3,118,3],[117,5,118,5],[111,0,112,0],[111,1,112,1],[111,2,112,2],[111,3,112,3],[111,5,112,5],[113,0,114,0],[113,1,114,1],[113,2,114,2],[113,3,114,3],[113,5,114,5],[107,0,108,0],[107,1,108,1],[107,2,108,2],[107,3,108,3],[107,5,108,5],[109,0,110,0],[109,1,110,1],[109,2,110,2],[109,3,110,3],[109,5,110,5],[100,0,101,0],[100,1,101,1],[100,2,101,2],[100,3,101,3],[100,5,101,5],[103,2,103,5],[105,0,106,0],[105,1,106,1],[105,2,106,2],[105,3,106,3],[105,5,106,5],[96,0,97,0],[96,1,97,1],[96,2,97,2],[96,3,97,3],[96,5,97,5],[98,0,99,0],[98,1,99,1],[98,2,99,2],[98,3,99,3],[98,5,99,5],[92,0,93,0],[92,1,93,1],[92,2,93,2],[92,3,93,3],[92,5,93,5],[94,0,95,0],[94,1,95,1],[94,2,95,2],[94,3,95,3],[94,5,95,5],[88,0,89,0],[88,1,89,1],[88,2,89,2],[88,3,89,3],[88,5,89,5],[90,0,91,0],[90,1,91,1],[90,2,91,2],[90,3,91,3],[90,5,91,5],[84,0,85,0],[84,1,85,1],[84,2,85,2],[84,3,85,3],[84,5,85,5],[86,0,87,0],[86,1,87,1],[86,2,87,2],[86,3,87,3],[86,5,87,5],[80,0,81,0],[80,1,81,1],[80,2,81,2],[80,3,81,3],[80,5,81,5],[82,0,83,0],[82,1,83,1],[82,2,83,2],[82,3,83,3],[82,5,83,5],[76,0,77,0],[76,1,77,1],[76,2,77,2],[76,3,77,3],[76,5,77,5],[78,0,79,0],[78,1,79,1],[78,2,79,2],[78,3,79,3],[78,5,79,5],[70,2,70,5],[72,0,73,0],[72,1,73,1],[72,2,73,2],[72,3,73,3],[72,5,73,5],[74,0,75,0],[74,1,75,1],[74,2,75,2],[74,3,75,3],[74,5,75,5],[67,0,68,0],[67,1,68,1],[67,2,68,2],[67,3,68,3],[67,5,68,5],[65,0,66,0],[65,1,66,1],[65,2,66,2],[65,3,66,3],[65,5,66,5],[63,0,64,0],[63,1,64,1],[63,2,64,2],[63,3,64,3],[63,5,64,5],[61,0,62,0],[61,1,62,1],[61,2,62,2],[61,3,62,3],[61,5,62,5],[59,0,60,0],[59,1,60,1],[59,2,60,2],[59,3,60,3],[59,5,60,5],[57,0,58,0],[57,1,58,1],[57,2,58,2],[57,3,58,3],[57,5,58,5],[55,0,56,0],[55,1,56,1],[55,2,56,2],[55,3,56,3],[55,5,56,5],[53,0,54,0],[53,1,54,1],[53,2,54,2],[53,3,54,3],[53,5,54,5],[51,0,52,0],[51,1,52,1],[51,2,52,2],[51,3,52,3],[51,5,52,5],[49,0,50,0],[49,1,50,1],[49,2,50,2],[49,3,50,3],[49,5,50,5],[47,0,48,0],[47,1,48,1],[47,2,48,2],[47,3,48,3],[47,5,48,5],[45,0,46,0],[45,1,46,1],[45,2,46,2],[45,3,46,3],[45,5,46,5],[43,0,44,0],[43,1,44,1],[43,2,44,2],[43,3,44,3],[43,5,44,5],[41,0,42,0],[41,1,42,1],[41,2,42,2],[41,3,42,3],[41,5,42,5],[39,0,40,0],[39,1,40,1],[39,2,40,2],[39,3,40,3],[39,5,40,5],[37,2,37,5],[34,0,35,0],[34,1,35,1],[34,2,35,2],[34,3,35,3],[34,5,35,5],[32,0,33,0],[32,1,33,1],[32,2,33,2],[32,3,33,3],[32,5,33,5],[30,0,31,0],[30,1,31,1],[30,2,31,2],[30,3,31,3],[30,5,31,5],[28,0,29,0],[28,1,29,1],[28,2,29,2],[28,3,29,3],[28,5,29,5],[26,0,27,0],[26,1,27,1],[26,2,27,2],[26,3,27,3],[26,5,27,5],[24,0,25,0],[24,1,25,1],[24,2,25,2],[24,3,25,3],[24,5,25,5],[22,0,23,0],[22,1,23,1],[22,2,23,2],[22,3,23,3],[22,5,23,5],[20,0,21,0],[20,1,21,1],[20,2,21,2],[20,3,21,3],[20,5,21,5],[18,0,19,0],[18,1,19,1],[18,2,19,2],[18,3,19,3],[18,5,19,5],[16,0,17,0],[16,1,17,1],[16,2,17,2],[16,3,17,3],[16,5,17,5],[14,0,15,0],[14,1,15,1],[14,2,15,2],[14,3,15,3],[14,5,15,5],[12,0,13,0],[12,1,13,1],[12,2,13,2],[12,3,13,3],[12,5,13,5],[10,0,11,0],[10,1,11,1],[10,2,11,2],[10,3,11,3],[10,5,11,5],[4,2,4,5],[8,0,9,0],[8,1,9,1],[8,2,9,2],[8,3,9,3],[8,5,9,5],[6,0,7,0],[6,1,7,1],[6,2,7,2],[6,3,7,3],[6,5,7,5]]}
["Wettkampfbogen",null,"Ort / Datum :",{"$f":"'INFO Blatt'!B11","v":"Hehlen"},null,{"$f":"'INFO Blatt'!B13","v":"2019-02-16"}]
[null,null,"Mannschaft:",{"$f":"Formeln!A9","v":"M5"},null,"Wertungsvorschriften"]
[null,null,"Liga:",{"$f":"'INFO Blatt'!B7","v":"Einsteigerliga"},null,{"$f":"'INFO Blatt'!B5","v":"P und AK"}]
[]
["Name","Jg","Boden"]
[null,null,"D-Note","Abzug OK","E- Abzug","Note"]
["frei 1"]
[]
["frei 2"]
[]
["frei 3"]
[]
["frei 4"]
[]
["frei 5"]
[]
["frei 6"]
[]
["frei 7"]
[]
["frei 8"]
[]
["frei 9"]
[]
["frei 10"]
[]
["frei 11"]
[]
["frei 12"]
[]
["frei 13"]
[]
["frei 14"]
[]
["frei 15"]
[]
[]
["Name","Jg","Pauschenpferd"]
[null,null,"D-Note","Abzug OK","E- Abzug","Note"]
[{"$f":"IF(A7>0,A7,\"\")","v":"frei 1"},{"$f":"IF(B7>0,B7,\"\")","v":""}]
[]
[{"$f":"IF(A9>0,A9,\"\")","v":"frei 2"},""]
[]
[{"$f":"IF(A11>0,A11,\"\")","v":"frei 3"},""]
[]
[{"$f":"IF(A13>0,A13,\"\")","v":"frei 4"},""]
[]
[{"$f":"IF(A15>0,A15,\"\")","v":"frei 5"},""]
[]
[{"$f":"IF(A17>0,A17,\"\")","v":"frei 6"},""]
[]
[{"$f":"IF(A19>0,A19,\"\")","v":"frei 7"},""]
[]
[{"$f":"IF(A21>0,A21,\"\")","v":"frei 8"},""]
[]
[{"$f":"IF(A23>0,A23,\"\")","v":"frei 9"},""]
[]
[{"$f":"IF(A25>0,A25,\"\")","v":"frei 10"},""]
[]
[{"$f":"IF(A27>0,A27,\"\")","v":"frei 11"},""]
[]
[{"$f":"IF(A29>0,A29,\"\")","v":"frei 12"},""]
[]
[{"$f":"IF(A31>0,A31,\"\")","v":"frei 13"},""]
[]
[{"$f":"IF(A33>0,A33,\"\")","v":"frei 14"},""]
[]
[{"$f":"IF(A35>0,A35,\"\")","v":"frei 15"},""]
[]
[]
["Name","Jg","Ringe"]
[null,null,"D-Note","Abzug OK","E- Abzug","Note"]
[{"$f":"IF(A40>0,A40,\"\")","v":"frei 1"},{"$f":"IF(B40>0,B40,\"\")","v":""}]
[]
[{"$f":"IF(A42>0,A42,\"\")","v":"frei 2"},""]
[]
[{"$f":"IF(A44>0,A44,\"\")","v":"frei 3"},""]
[]
[{"$f":"IF(A46>0,A46,\"\")","v":"frei 4"},""]
[]
[{"$f":"IF(A48>0,A48,\"\")","v":"frei 5"},""]
[]
[{"$f":"IF(A50>0,A50,\"\")","v":"frei 6"},""]
[]
[{"$f":"IF(A52>0,A52,\"\")","v":"frei 7"},""]
[]
[{"$f":"IF(A54>0,A54,\"\")","v":"frei 8"},""]
[]
[{"$f":"IF(A56>0,A56,\"\")","v":"frei 9"},""]
[]
[{"$f":"IF(A58>0,A58,\"\")","v":"frei 10"},""]
[]
[{"$f":"IF(A60>0,A60,\"\")","v":"frei 11"},""]
[]
[{"$f":"IF(A62>0,A62,\"\")","v":"frei 12"},""]
[]
[{"$f":"IF(A64>0,A64,\"\")","v":"frei 13"},""]
[]
[{"$f":"IF(A66>0,A66,\"\")","v":"frei 14"},""]
[]
[{"$f":"IF(A68>0,A68,\"\")","v":"frei 15"},""]
[]
[]
["Name","Jg","Sprung"]
[null,null,"D-Note","Abzug OK","E- Abzug","Note"]
[{"$f":"IF(A73>0,A73,\"\")","v":"frei 1"},{"$f":"IF(B73>0,B73,\"\")","v":""}]
[]
[{"$f":"IF(A75>0,A75,\"\")","v":"frei 2"},""]
[]
[{"$f":"IF(A77>0,A77,\"\")","v":"frei 3"},""]
[]
[{"$f":"IF(A79>0,A79,\"\")","v":"frei 4"},""]
[]
[{"$f":"IF(A81>0,A81,\"\")","v":"frei 5"},""]
[]
[{"$f":"IF(A83>0,A83,\"\")","v":"frei 6"},""]
[]
[{"$f":"IF(A85>0,A85,\"\")","v":"frei 7"},""]
[]
[{"$f":"IF(A87>0,A87,\"\")","v":"frei 8"},""]
[]
[{"$f":"IF(A89>0,A89,\"\")","v":"frei 9"},""]
[]
[{"$f":"IF(A91>0,A91,\"\")","v":"frei 10"},""]
[]
[{"$f":"IF(A93>0,A93,\"\")","v":"frei 11"},""]
[]
[{"$f":"IF(A95>0,A95,\"\")","v":"frei 12"},""]
[]
[{"$f":"IF(A97>0,A97,\"\")","v":"frei 13"},""]
[]
[{"$f":"IF(A99>0,A99,\"\")","v":"frei 14"},""]
[]
[{"$f":"IF(A101>0,A101,\"\")","v":"frei 15"},""]
[]
[]
["Name","Jg","Barren"]
[null,null,"D-Note","Abzug OK","E- Abzug","Note"]
[{"$f":"IF(A106>0,A106,\"\")","v":"frei 1"},{"$f":"IF(B106>0,B106,\"\")","v":""}]
[]
[{"$f":"IF(A108>0,A108,\"\")","v":"frei 2"},""]
[]
[{"$f":"IF(A110>0,A110,\"\")","v":"frei 3"},""]
[]
[{"$f":"IF(A112>0,A112,\"\")","v":"frei 4"},""]
[]
[{"$f":"IF(A114>0,A114,\"\")","v":"frei 5"},""]
[]
[{"$f":"IF(A116>0,A116,\"\")","v":"frei 6"},""]
[]
[{"$f":"IF(A118>0,A118,\"\")","v":"frei 7"},""]
[]
[{"$f":"IF(A120>0,A120,\"\")","v":"frei 8"},""]
[]
[{"$f":"IF(A122>0,A122,\"\")","v":"frei 9"},""]
[]
[{"$f":"IF(A124>0,A124,\"\")","v":"frei 10"},""]
[]
[{"$f":"IF(A126>0,A126,\"\")","v":"frei 11"},""]
[]
[{"$f":"IF(A128>0,A128,\"\")","v":"frei 12"},""]
[]
[{"$f":"IF(A130>0,A130,\"\")","v":"frei 13"},""]
[]
[{"$f":"IF(A132>0,A132,\"\")","v":"frei 14"},""]
[]
[{"$f":"IF(A134>0,A134,\"\")","v":"frei 15"},""]
[]
[]
["Name","Jg","Reck"]
[null,null,"D-Note","Abzug OK","E- Abzug","Note"]
[{"$f":"IF(A139>0,A139,\"\")","v":"frei 1"},{"$f":"IF(B139>0,B139,\"\")","v":""}]
[]
[{"$f":"IF(A141>0,A141,\"\")","v":"frei 2"},""]
[]
[{"$f":"IF(A143>0,A143,\"\")","v":"frei 3"},""]
[]
[{"$f":"IF(A145>0,A145,\"\")","v":"frei 4"},""]
[]
[{"$f":"IF(A147>0,A147,\"\")","v":"frei 5"},""]
[]
[{"$f":"IF(A149>0,A149,\"\")","v":"frei 6"},""]
[]
[{"$f":"IF(A151>0,A151,\"\")","v":"frei 7"},""]
[]
[{"$f":"IF(A153>0,A153,\"\")","v":"frei 8"},""]
[]
[{"$f":"IF(A155>0,A155,\"\")","v":"frei 9"},""]
[]
[{"$f":"IF(A157>0,A157,\"\")","v":"frei 10"},""]
[]
[{"$f":"IF(A159>0,A159,\"\")","v":"frei 11"},""]
[]
[{"$f":"IF(A161>0,A161,\"\")","v":"frei 12"},""]
[]
[{"$f":"IF(A163>0,A163,\"\")","v":"frei 13"},""]
[]
[{"$f":"IF(A165>0,A165,\"\")","v":"frei 14"},""]
[]
[{"$f":"IF(A167>0,A167,\"\")","v":"frei 15"},""]

{"sheet":"Wertungszettel M6","index":19,"n_rows":200,"n_cols":6,"rows_kept":200,"cut":false,"hidden":false,"merged":[[0,3,0,4],[1,3,1,4],[2,3,2,4],[197,0,198,0],[197,1,198,1],[197,2,198,2],[197,3,198,3],[197,5,198,5],[199,0,200,0],[199,1,200,1],[199,2,200,2],[199,3,200,3],[199,5,200,5],[193,0,194,0],[193,1,194,1],[193,2,194,2],[193,3,194,3],[193,5,194,5],[195,0,196,0],[195,1,196,1],[195,2,196,2],[195,3,196,3],[195,5,196,5],[189,0,190,0],[189,1,190,1],[189,2,190,2],[189,3,190,3],[189,5,190,5],[191,0,192,0],[191,1,192,1],[191,2,192,2],[191,3,192,3],[191,5,192,5],[185,0,186,0],[185,1,186,1],[185,2,186,2],[185,3,186,3],[185,5,186,5],[187,0,188,0],[187,1,188,1],[187,2,188,2],[187,3,188,3],[187,5,188,5],[181,0,182,0],[181,1,182,1],[181,2,182,2],[181,3,182,3],[181,5,182,5],[183,0,184,0],[183,1,184,1],[183,2,184,2],[183,3,184,3],[183,5,184,5],[177,0,178,0],[177,1,178,1],[177,2,178,2],[177,3,178,3],[177,5,178,5],[179,0,180,0],[179,1,180,1],[179,2,180,2],[179,3,180,3],[179,5,180,5],[173,0,174,0],[173,1,174,1],[173,2,174,2],[173,3,174,3],[173,5,174,5],[175,0,176,0],[175,1,176,1],[175,2,176,2],[175,3,176,3],[175,5,176,5],[166,0,167,0],[166,1,167,1],[166,2,167,2],[166,3,167,3],[166,5,167,5],[169,2,169,5],[171,0,172,0],[171,1,172,1],[171,2,172,2],[171,3,172,3],[171,5,172,5],[162,0,163,0],[162,1,163,1],[162,2,163,2],[162,3,163,3],[162,5,163,5],[164,0,165,0],[164,1,165,1],[164,2,165,2],[164,3,165,3],[164,5,165,5],[158,0,159,0],[158,1,159,1],[158,2,159,2],[158,3,159,3],[158,5,159,5],[160,0,161,0],[160,1,161,1],[160,2,161,2],[160,3,161,3],[160,5,161,5],[154,0,155,0],[154,1,155,1],[154,2,155,2],[154,3,155,3],[154,5,155,5],[156,0,157,0],[156,1,157,1],[156,2,157,2],[156,3,157,3],[156,5,157,5],[150,0,151,0],[150,1,151,1],[150,2,151,2],[150,3,151,3],[150,5,151,5],[152,0,153,0],[152,1,153,1],[152,2,153,2],[152,3,153,3],[152,5,153,5],[146,0,147,0],[146,1,147,1],[146,2,147,2],[146,3,147,3],[146,5,147,5],[148,0,149,0],[148,1,149,1],[148,2,149,2],[148,3,149,3],[148,5,149,5],[142,0,143,0],[142,1,143,1],[142,2,143,2],[142,3,143,3],[142,5,143,5],[144,0,145,0],[144,1,145,1],[144,2,145,2],[144,3,145,3],[144,5,145,5],[136,2,136,5],[138,0,139,0],[138,1,139,1],[138,2,139,2],[138,3,139,3],[138,5,139,5],[140,0,141,0],[140,1,141,1],[140,2,141,2],[140,3,141,3],[140,5,141,5],[131,0,132,0],[131,1,132,1],[131,2,132,2],[131,3,132,3],[131,5,132,5],[133,0,134,0],[133,1,134,1],[133,2,134,2],[133,3,134,3],[133,5,134,5],[127,0,128,0],[127,1,128,1],[127,2,128,2],[127,3,128,3],[127,5,128,5],[129,0,130,0],[129,1,130,1],[129,2,130,2],[129,3,130,3],[129,5,130,5],[123,0,124,0],[123,1,124,1],[123,2,124,2],[123,3,124,3],[123,5,124,5],[125,0,126,0],[125,1,126,1],[125,2,126,2],[125,3,126,3],[125,5,126,5],[119,0,120,0],[119,1,120,1],[119,2,120,2],[119,3,120,3],[119,5,120,5],[121,0,122,0],[121,1,122,1],[121,2,122,2],[121,3,122,3],[121,5,122,5],[115,0,116,0],[115,1,116,1],[115,2,116,2],[115,3,116,3],[115,5,116,5],[117,0,118,0],[117,1,118,1],[117,2,118,2],[117,3,118,3],[117,5,118,5],[111,0,112,0],[111,1,112,1],[111,2,112,2],[111,3,112,3],[111,5,112,5],[113,0,114,0],[113,1,114,1],[113,2,114,2],[113,3,114,3],[113,5,114,5],[107,0,108,0],[107,1,108,1],[107,2,108,2],[107,3,108,3],[107,5,108,5],[109,0,110,0],[109,1,110,1],[109,2,110,2],[109,3,110,3],[109,5,110,5],[100,0,101,0],[100,1,101,1],[100,2,101,2],[100,3,101,3],[100,5,101,5],[103,2,103,5],[105,0,106,0],[105,1,106,1],[105,2,106,2],[105,3,106,3],[105,5,106,5],[96,0,97,0],[96,1,97,1],[96,2,97,2],[96,3,97,3],[96,5,97,5],[98,0,99,0],[98,1,99,1],[98,2,99,2],[98,3,99,3],[98,5,99,5],[92,0,93,0],[92,1,93,1],[92,2,93,2],[92,3,93,3],[92,5,93,5],[94,0,95,0],[94,1,95,1],[94,2,95,2],[94,3,95,3],[94,5,95,5],[88,0,89,0],[88,1,89,1],[88,2,89,2],[88,3,89,3],[88,5,89,5],[90,0,91,0],[90,1,91,1],[90,2,91,2],[90,3,91,3],[90,5,91,5],[84,0,85,0],[84,1,85,1],[84,2,85,2],[84,3,85,3],[84,5,85,5],[86,0,87,0],[86,1,87,1],[86,2,87,2],[86,3,87,3],[86,5,87,5],[80,0,81,0],[80,1,81,1],[80,2,81,2],[80,3,81,3],[80,5,81,5],[82,0,83,0],[82,1,83,1],[82,2,83,2],[82,3,83,3],[82,5,83,5],[76,0,77,0],[76,1,77,1],[76,2,77,2],[76,3,77,3],[76,5,77,5],[78,0,79,0],[78,1,79,1],[78,2,79,2],[78,3,79,3],[78,5,79,5],[70,2,70,5],[72,0,73,0],[72,1,73,1],[72,2,73,2],[72,3,73,3],[72,5,73,5],[74,0,75,0],[74,1,75,1],[74,2,75,2],[74,3,75,3],[74,5,75,5],[67,0,68,0],[67,1,68,1],[67,2,68,2],[67,3,68,3],[67,5,68,5],[65,0,66,0],[65,1,66,1],[65,2,66,2],[65,3,66,3],[65,5,66,5],[63,0,64,0],[63,1,64,1],[63,2,64,2],[63,3,64,3],[63,5,64,5],[61,0,62,0],[61,1,62,1],[61,2,62,2],[61,3,62,3],[61,5,62,5],[59,0,60,0],[59,1,60,1],[59,2,60,2],[59,3,60,3],[59,5,60,5],[57,0,58,0],[57,1,58,1],[57,2,58,2],[57,3,58,3],[57,5,58,5],[55,0,56,0],[55,1,56,1],[55,2,56,2],[55,3,56,3],[55,5,56,5],[53,0,54,0],[53,1,54,1],[53,2,54,2],[53,3,54,3],[53,5,54,5],[51,0,52,0],[51,1,52,1],[51,2,52,2],[51,3,52,3],[51,5,52,5],[49,0,50,0],[49,1,50,1],[49,2,50,2],[49,3,50,3],[49,5,50,5],[47,0,48,0],[47,1,48,1],[47,2,48,2],[47,3,48,3],[47,5,48,5],[45,0,46,0],[45,1,46,1],[45,2,46,2],[45,3,46,3],[45,5,46,5],[43,0,44,0],[43,1,44,1],[43,2,44,2],[43,3,44,3],[43,5,44,5],[41,0,42,0],[41,1,42,1],[41,2,42,2],[41,3,42,3],[41,5,42,5],[39,0,40,0],[39,1,40,1],[39,2,40,2],[39,3,40,3],[39,5,40,5],[37,2,37,5],[34,0,35,0],[34,1,35,1],[34,2,35,2],[34,3,35,3],[34,5,35,5],[32,0,33,0],[32,1,33,1],[32,2,33,2],[32,3,33,3],[32,5,33,5],[30,0,31,0],[30,1,31,1],[30,2,31,2],[30,3,31,3],[30,5,31,5],[28,0,29,0],[28,1,29,1],[28,2,29,2],[28,3,29,3],[28,5,29,5],[26,0,27,0],[26,1,27,1],[26,2,27,2],[26,3,27,3],[26,5,27,5],[24,0,25,0],[24,1,25,1],[24,2,25,2],[24,3,25,3],[24,5,25,5],[22,0,23,0],[22,1,23,1],[22,2,23,2],[22,3,23,3],[22,5,23,5],[20,0,21,0],[20,1,21,1],[20,2,21,2],[20,3,21,3],[20,5,21,5],[18,0,19,0],[18,1,19,1],[18,2,19,2],[18,3,19,3],[18,5,19,5],[16,0,17,0],[16,1,17,1],[16,2,17,2],[16,3,17,3],[16,5,17,5],[14,0,15,0],[14,1,15,1],[14,2,15,2],[14,3,15,3],[14,5,15,5],[12,0,13,0],[12,1,13,1],[12,2,13,2],[12,3,13,3],[12,5,13,5],[10,0,11,0],[10,1,11,1],[10,2,11,2],[10,3,11,3],[10,5,11,5],[4,2,4,5],[8,0,9,0],[8,1,9,1],[8,2,9,2],[8,3,9,3],[8,5,9,5],[6,0,7,0],[6,1,7,1],[6,2,7,2],[6,3,7,3],[6,5,7,5]]}
["Wettkampfbogen",null,"Ort / Datum :",{"$f":"'INFO Blatt'!B11","v":"Hehlen"},null,{"$f":"'INFO Blatt'!B13","v":"2019-02-16"}]
[null,null,"Mannschaft:",{"$f":"Formeln!A10","v":"M6"},null,"Wertungsvorschriften"]
[null,null,"Liga:",{"$f":"'INFO Blatt'!B7","v":"Einsteigerliga"},null,{"$f":"'INFO Blatt'!B5","v":"P und AK"}]
[]
["Name","Jg","Boden"]
[null,null,"D-Note","Abzug OK","E- Abzug","Note"]
["frei 1"]
[]
["frei 2"]
[]
["frei 3"]
[]
["frei 4"]
[]
["frei 5"]
[]
["frei 6"]
[]
["frei 7"]
[]
["frei 8"]
[]
["frei 9"]
[]
["frei 10"]
[]
["frei 11"]
[]
["frei 12"]
[]
["frei 13"]
[]
["frei 14"]
[]
["frei 15"]
[]
[]
["Name","Jg","Pauschenpferd"]
[null,null,"D-Note","Abzug OK","E- Abzug","Note"]
[{"$f":"IF(A7>0,A7,\"\")","v":"frei 1"},{"$f":"IF(B7>0,B7,\"\")","v":""}]
[]
[{"$f":"IF(A9>0,A9,\"\")","v":"frei 2"},""]
[]
[{"$f":"IF(A11>0,A11,\"\")","v":"frei 3"},""]
[]
[{"$f":"IF(A13>0,A13,\"\")","v":"frei 4"},""]
[]
[{"$f":"IF(A15>0,A15,\"\")","v":"frei 5"},""]
[]
[{"$f":"IF(A17>0,A17,\"\")","v":"frei 6"},""]
[]
[{"$f":"IF(A19>0,A19,\"\")","v":"frei 7"},""]
[]
[{"$f":"IF(A21>0,A21,\"\")","v":"frei 8"},""]
[]
[{"$f":"IF(A23>0,A23,\"\")","v":"frei 9"},""]
[]
[{"$f":"IF(A25>0,A25,\"\")","v":"frei 10"},""]
[]
[{"$f":"IF(A27>0,A27,\"\")","v":"frei 11"},""]
[]
[{"$f":"IF(A29>0,A29,\"\")","v":"frei 12"},""]
[]
[{"$f":"IF(A31>0,A31,\"\")","v":"frei 13"},""]
[]
[{"$f":"IF(A33>0,A33,\"\")","v":"frei 14"},""]
[]
[{"$f":"IF(A35>0,A35,\"\")","v":"frei 15"},""]
[]
[]
["Name","Jg","Ringe"]
[null,null,"D-Note","Abzug OK","E- Abzug","Note"]
[{"$f":"IF(A40>0,A40,\"\")","v":"frei 1"},{"$f":"IF(B40>0,B40,\"\")","v":""}]
[]
[{"$f":"IF(A42>0,A42,\"\")","v":"frei 2"},""]
[]
[{"$f":"IF(A44>0,A44,\"\")","v":"frei 3"},""]
[]
[{"$f":"IF(A46>0,A46,\"\")","v":"frei 4"},""]
[]
[{"$f":"IF(A48>0,A48,\"\")","v":"frei 5"},""]
[]
[{"$f":"IF(A50>0,A50,\"\")","v":"frei 6"},""]
[]
[{"$f":"IF(A52>0,A52,\"\")","v":"frei 7"},""]
[]
[{"$f":"IF(A54>0,A54,\"\")","v":"frei 8"},""]
[]
[{"$f":"IF(A56>0,A56,\"\")","v":"frei 9"},""]
[]
[{"$f":"IF(A58>0,A58,\"\")","v":"frei 10"},""]
[]
[{"$f":"IF(A60>0,A60,\"\")","v":"frei 11"},""]
[]
[{"$f":"IF(A62>0,A62,\"\")","v":"frei 12"},""]
[]
[{"$f":"IF(A64>0,A64,\"\")","v":"frei 13"},""]
[]
[{"$f":"IF(A66>0,A66,\"\")","v":"frei 14"},""]
[]
[{"$f":"IF(A68>0,A68,\"\")","v":"frei 15"},""]
[]
[]
["Name","Jg","Sprung"]
[null,null,"D-Note","Abzug OK","E- Abzug","Note"]
[{"$f":"IF(A73>0,A73,\"\")","v":"frei 1"},{"$f":"IF(B73>0,B73,\"\")","v":""}]
[]
[{"$f":"IF(A75>0,A75,\"\")","v":"frei 2"},""]
[]
[{"$f":"IF(A77>0,A77,\"\")","v":"frei 3"},""]
[]
[{"$f":"IF(A79>0,A79,\"\")","v":"frei 4"},""]
[]
[{"$f":"IF(A81>0,A81,\"\")","v":"frei 5"},""]
[]
[{"$f":"IF(A83>0,A83,\"\")","v":"frei 6"},""]
[]
[{"$f":"IF(A85>0,A85,\"\")","v":"frei 7"},""]
[]
[{"$f":"IF(A87>0,A87,\"\")","v":"frei 8"},""]
[]
[{"$f":"IF(A89>0,A89,\"\")","v":"frei 9"},""]
[]
[{"$f":"IF(A91>0,A91,\"\")","v":"frei 10"},""]
[]
[{"$f":"IF(A93>0,A93,\"\")","v":"frei 11"},""]
[]
[{"$f":"IF(A95>0,A95,\"\")","v":"frei 12"},""]
[]
[{"$f":"IF(A97>0,A97,\"\")","v":"frei 13"},""]
[]
[{"$f":"IF(A99>0,A99,\"\")","v":"frei 14"},""]
[]
[{"$f":"IF(A101>0,A101,\"\")","v":"frei 15"},""]
[]
[]
["Name","Jg","Barren"]
[null,null,"D-Note","Abzug OK","E- Abzug","Note"]
[{"$f":"IF(A106>0,A106,\"\")","v":"frei 1"},{"$f":"IF(B106>0,B106,\"\")","v":""}]
[]
[{"$f":"IF(A108>0,A108,\"\")","v":"frei 2"},""]
[]
[{"$f":"IF(A110>0,A110,\"\")","v":"frei 3"},""]
[]
[{"$f":"IF(A112>0,A112,\"\")","v":"frei 4"},""]
[]
[{"$f":"IF(A114>0,A114,\"\")","v":"frei 5"},""]
[]
[{"$f":"IF(A116>0,A116,\"\")","v":"frei 6"},""]
[]
[{"$f":"IF(A118>0,A118,\"\")","v":"frei 7"},""]
[]
[{"$f":"IF(A120>0,A120,\"\")","v":"frei 8"},""]
[]
[{"$f":"IF(A122>0,A122,\"\")","v":"frei 9"},""]
[]
[{"$f":"IF(A124>0,A124,\"\")","v":"frei 10"},""]
[]
[{"$f":"IF(A126>0,A126,\"\")","v":"frei 11"},""]
[]
[{"$f":"IF(A128>0,A128,\"\")","v":"frei 12"},""]
[]
[{"$f":"IF(A130>0,A130,\"\")","v":"frei 13"},""]
[]
[{"$f":"IF(A132>0,A132,\"\")","v":"frei 14"},""]
[]
[{"$f":"IF(A134>0,A134,\"\")","v":"frei 15"},""]
[]
[]
["Name","Jg","Reck"]
[null,null,"D-Note","Abzug OK","E- Abzug","Note"]
[{"$f":"IF(A139>0,A139,\"\")","v":"frei 1"},{"$f":"IF(B139>0,B139,\"\")","v":""}]
[]
[{"$f":"IF(A141>0,A141,\"\")","v":"frei 2"},""]
[]
[{"$f":"IF(A143>0,A143,\"\")","v":"frei 3"},""]
[]
[{"$f":"IF(A145>0,A145,\"\")","v":"frei 4"},""]
[]
[{"$f":"IF(A147>0,A147,\"\")","v":"frei 5"},""]
[]
[{"$f":"IF(A149>0,A149,\"\")","v":"frei 6"},""]
[]
[{"$f":"IF(A151>0,A151,\"\")","v":"frei 7"},""]
[]
[{"$f":"IF(A153>0,A153,\"\")","v":"frei 8"},""]
[]
[{"$f":"IF(A155>0,A155,\"\")","v":"frei 9"},""]
[]
[{"$f":"IF(A157>0,A157,\"\")","v":"frei 10"},""]
[]
[{"$f":"IF(A159>0,A159,\"\")","v":"frei 11"},""]
[]
[{"$f":"IF(A161>0,A161,\"\")","v":"frei 12"},""]
[]
[{"$f":"IF(A163>0,A163,\"\")","v":"frei 13"},""]
[]
[{"$f":"IF(A165>0,A165,\"\")","v":"frei 14"},""]
[]
[{"$f":"IF(A167>0,A167,\"\")","v":"frei 15"},""]

{"sheet":"Wertungszettel M7","index":20,"n_rows":200,"n_cols":6,"rows_kept":200,"cut":false,"hidden":false,"merged":[[0,3,0,4],[1,3,1,4],[2,3,2,4],[4,2,4,5],[6,0,7,0],[6,1,7,1],[6,2,7,2],[6,3,7,3],[6,5,7,5],[8,0,9,0],[8,1,9,1],[8,2,9,2],[8,3,9,3],[8,5,9,5],[10,0,11,0],[10,1,11,1],[10,2,11,2],[10,3,11,3],[10,5,11,5],[12,0,13,0],[12,1,13,1],[12,2,13,2],[12,3,13,3],[12,5,13,5],[14,0,15,0],[14,1,15,1],[14,2,15,2],[14,3,15,3],[14,5,15,5],[16,0,17,0],[16,1,17,1],[16,2,17,2],[16,3,17,3],[16,5,17,5],[18,0,19,0],[18,1,19,1],[18,2,19,2],[18,3,19,3],[18,5,19,5],[20,0,21,0],[20,1,21,1],[20,2,21,2],[20,3,21,3],[20,5,21,5],[22,0,23,0],[22,1,23,1],[22,2,23,2],[22,3,23,3],[22,5,23,5],[24,0,25,0],[24,1,25,1],[24,2,25,2],[24,3,25,3],[24,5,25,5],[26,0,27,0],[26,1,27,1],[26,2,27,2],[26,3,27,3],[26,5,27,5],[28,0,29,0],[28,1,29,1],[28,2,29,2],[28,3,29,3],[28,5,29,5],[30,0,31,0],[30,1,31,1],[30,2,31,2],[30,3,31,3],[30,5,31,5],[37,2,37,5],[39,0,40,0],[39,1,40,1],[39,2,40,2],[39,3,40,3],[39,5,40,5],[32,0,33,0],[32,1,33,1],[32,2,33,2],[32,3,33,3],[32,5,33,5],[34,0,35,0],[34,1,35,1],[34,2,35,2],[34,3,35,3],[34,5,35,5],[41,0,42,0],[41,1,42,1],[41,2,42,2],[41,3,42,3],[41,5,42,5],[43,0,44,0],[43,1,44,1],[43,2,44,2],[43,3,44,3],[43,5,44,5],[45,0,46,0],[45,1,46,1],[45,2,46,2],[45,3,46,3],[45,5,46,5],[47,0,48,0],[47,1,48,1],[47,2,48,2],[47,3,48,3],[47,5,48,5],[49,0,50,0],[49,1,50,1],[49,2,50,2],[49,3,50,3],[49,5,50,5],[51,0,52,0],[51,1,52,1],[51,2,52,2],[51,3,52,3],[51,5,52,5],[53,0,54,0],[53,1,54,1],[53,2,54,2],[53,3,54,3],[53,5,54,5],[55,0,56,0],[55,1,56,1],[55,2,56,2],[55,3,56,3],[55,5,56,5],[57,0,58,0],[57,1,58,1],[57,2,58,2],[57,3,58,3],[57,5,58,5],[59,0,60,0],[59,1,60,1],[59,2,60,2],[59,3,60,3],[59,5,60,5],[61,0,62,0],[61,1,62,1],[61,2,62,2],[61,3,62,3],[61,5,62,5],[63,0,64,0],[63,1,64,1],[63,2,64,2],[63,3,64,3],[63,5,64,5],[70,2,70,5],[72,0,73,0],[72,1,73,1],[72,2,73,2],[72,3,73,3],[72,5,73,5],[65,0,66,0],[65,1,66,1],[65,2,66,2],[65,3,66,3],[65,5,66,5],[67,0,68,0],[67,1,68,1],[67,2,68,2],[67,3,68,3],[67,5,68,5],[74,0,75,0],[74,1,75,1],[74,2,75,2],[74,3,75,3],[74,5,75,5],[76,0,77,0],[76,1,77,1],[76,2,77,2],[76,3,77,3],[76,5,77,5],[78,0,79,0],[78,1,79,1],[78,2,79,2],[78,3,79,3],[78,5,79,5],[80,0,81,0],[80,1,81,1],[80,2,81,2],[80,3,81,3],[80,5,81,5],[82,0,83,0],[82,1,83,1],[82,2,83,2],[82,3,83,3],[82,5,83,5],[84,0,85,0],[84,1,85,1],[84,2,85,2],[84,3,85,3],[84,5,85,5],[86,0,87,0],[86,1,87,1],[86,2,87,2],[86,3,87,3],[86,5,87,5],[88,0,89,0],[88,1,89,1],[88,2,89,2],[88,3,89,3],[88,5,89,5],[90,0,91,0],[90,1,91,1],[90,2,91,2],[90,3,91,3],[90,5,91,5],[92,0,93,0],[92,1,93,1],[92,2,93,2],[92,3,93,3],[92,5,93,5],[94,0,95,0],[94,1,95,1],[94,2,95,2],[94,3,95,3],[94,5,95,5],[96,0,97,0],[96,1,97,1],[96,2,97,2],[96,3,97,3],[96,5,97,5],[103,2,103,5],[105,0,106,0],[105,1,106,1],[105,2,106,2],[105,3,106,3],[105,5,106,5],[98,0,99,0],[98,1,99,1],[98,2,99,2],[98,3,99,3],[98,5,99,5],[100,0,101,0],[100,1,101,1],[100,2,101,2],[100,3,101,3],[100,5,101,5],[107,0,108,0],[107,1,108,1],[107,2,108,2],[107,3,108,3],[107,5,108,5],[109,0,110,0],[109,1,110,1],[109,2,110,2],[109,3,110,3],[109,5,110,5],[111,0,112,0],[111,1,112,1],[111,2,112,2],[111,3,112,3],[111,5,112,5],[113,0,114,0],[113,1,114,1],[113,2,114,2],[113,3,114,3],[113,5,114,5],[115,0,116,0],[115,1,116,1],[115,2,116,2],[115,3,116,3],[115,5,116,5],[117,0,118,0],[117,1,118,1],[117,2,118,2],[117,3,118,3],[117,5,118,5],[119,0,120,0],[119,1,120,1],[119,2,120,2],[119,3,120,3],[119,5,120,5],[121,0,122,0],[121,1,122,1],[121,2,122,2],[121,3,122,3],[121,5,122,5],[123,0,124,0],[123,1,124,1],[123,2,124,2],[123,3,124,3],[123,5,124,5],[125,0,126,0],[125,1,126,1],[125,2,126,2],[125,3,126,3],[125,5,126,5],[127,0,128,0],[127,1,128,1],[127,2,128,2],[127,3,128,3],[127,5,128,5],[129,0,130,0],[129,1,130,1],[129,2,130,2],[129,3,130,3],[129,5,130,5],[136,2,136,5],[138,0,139,0],[138,1,139,1],[138,2,139,2],[138,3,139,3],[138,5,139,5],[131,0,132,0],[131,1,132,1],[131,2,132,2],[131,3,132,3],[131,5,132,5],[133,0,134,0],[133,1,134,1],[133,2,134,2],[133,3,134,3],[133,5,134,5],[140,0,141,0],[140,1,141,1],[140,2,141,2],[140,3,141,3],[140,5,141,5],[142,0,143,0],[142,1,143,1],[142,2,143,2],[142,3,143,3],[142,5,143,5],[144,0,145,0],[144,1,145,1],[144,2,145,2],[144,3,145,3],[144,5,145,5],[146,0,147,0],[146,1,147,1],[146,2,147,2],[146,3,147,3],[146,5,147,5],[148,0,149,0],[148,1,149,1],[148,2,149,2],[148,3,149,3],[148,5,149,5],[150,0,151,0],[150,1,151,1],[150,2,151,2],[150,3,151,3],[150,5,151,5],[152,0,153,0],[152,1,153,1],[152,2,153,2],[152,3,153,3],[152,5,153,5],[154,0,155,0],[154,1,155,1],[154,2,155,2],[154,3,155,3],[154,5,155,5],[156,0,157,0],[156,1,157,1],[156,2,157,2],[156,3,157,3],[156,5,157,5],[158,0,159,0],[158,1,159,1],[158,2,159,2],[158,3,159,3],[158,5,159,5],[160,0,161,0],[160,1,161,1],[160,2,161,2],[160,3,161,3],[160,5,161,5],[162,0,163,0],[162,1,163,1],[162,2,163,2],[162,3,163,3],[162,5,163,5],[169,2,169,5],[171,0,172,0],[171,1,172,1],[171,2,172,2],[171,3,172,3],[171,5,172,5],[164,0,165,0],[164,1,165,1],[164,2,165,2],[164,3,165,3],[164,5,165,5],[166,0,167,0],[166,1,167,1],[166,2,167,2],[166,3,167,3],[166,5,167,5],[173,0,174,0],[173,1,174,1],[173,2,174,2],[173,3,174,3],[173,5,174,5],[175,0,176,0],[175,1,176,1],[175,2,176,2],[175,3,176,3],[175,5,176,5],[177,0,178,0],[177,1,178,1],[177,2,178,2],[177,3,178,3],[177,5,178,5],[179,0,180,0],[179,1,180,1],[179,2,180,2],[179,3,180,3],[179,5,180,5],[181,0,182,0],[181,1,182,1],[181,2,182,2],[181,3,182,3],[181,5,182,5],[183,0,184,0],[183,1,184,1],[183,2,184,2],[183,3,184,3],[183,5,184,5],[185,0,186,0],[185,1,186,1],[185,2,186,2],[185,3,186,3],[185,5,186,5],[187,0,188,0],[187,1,188,1],[187,2,188,2],[187,3,188,3],[187,5,188,5],[189,0,190,0],[189,1,190,1],[189,2,190,2],[189,3,190,3],[189,5,190,5],[191,0,192,0],[191,1,192,1],[191,2,192,2],[191,3,192,3],[191,5,192,5],[193,0,194,0],[193,1,194,1],[193,2,194,2],[193,3,194,3],[193,5,194,5],[195,0,196,0],[195,1,196,1],[195,2,196,2],[195,3,196,3],[195,5,196,5],[197,0,198,0],[197,1,198,1],[197,2,198,2],[197,3,198,3],[197,5,198,5],[199,0,200,0],[199,1,200,1],[199,2,200,2],[199,3,200,3],[199,5,200,5]]}
["Wettkampfbogen",null,"Ort / Datum :",{"$f":"'INFO Blatt'!B11","v":"Hehlen"},null,{"$f":"'INFO Blatt'!B13","v":"2019-02-16"}]
[null,null,"Mannschaft:",{"$f":"Formeln!A11","v":"M7"},null,"Wertungsvorschriften"]
[null,null,"Liga:",{"$f":"'INFO Blatt'!B7","v":"Einsteigerliga"},null,{"$f":"'INFO Blatt'!B5","v":"P und AK"}]
[]
["Name","Jg","Boden"]
[null,null,"D-Note","Abzug OK","E- Abzug","Note"]
[1,"1"]
[]
[2,"2"]
[]
[3,"3"]
[]
[4,"4"]
[]
[5,"5"]
[]
[6,"6"]
[]
[7,"7"]
[]
[8,"8"]
[]
[9,"9"]
[]
[10,"10"]
[]
[11,"11"]
[]
[12,"12"]
[]
[13,"13"]
[]
[14,"14"]
[]
[15,"15"]
[]
[]
["Name","Jg","Pauschenpferd"]
[null,null,"D-Note","Abzug OK","E- Abzug","Note"]
[{"$f":"IF(A7>0,A7,\"\")","v":1},{"$f":"IF(B7>0,B7,\"\")","v":"1"}]
[]
[{"$f":"IF(A9>0,A9,\"\")","v":2},"2"]
[]
[{"$f":"IF(A11>0,A11,\"\")","v":3},"3"]
[]
[{"$f":"IF(A13>0,A13,\"\")","v":4},"4"]
[]
[{"$f":"IF(A15>0,A15,\"\")","v":5},"5"]
[]
[{"$f":"IF(A17>0,A17,\"\")","v":6},"6"]
[]
[{"$f":"IF(A19>0,A19,\"\")","v":7},"7"]
[]
[{"$f":"IF(A21>0,A21,\"\")","v":8},"8"]
[]
[{"$f":"IF(A23>0,A23,\"\")","v":9},"9"]
[]
[{"$f":"IF(A25>0,A25,\"\")","v":10},"10"]
[]
[{"$f":"IF(A27>0,A27,\"\")","v":11},"11"]
[]
[{"$f":"IF(A29>0,A29,\"\")","v":12},"12"]
[]
[{"$f":"IF(A31>0,A31,\"\")","v":13},"13"]
[]
[{"$f":"IF(A33>0,A33,\"\")","v":14},"14"]
[]
[{"$f":"IF(A35>0,A35,\"\")","v":15},"15"]
[]
[]
["Name","Jg","Ringe"]
[null,null,"D-Note","Abzug OK","E- Abzug","Note"]
[{"$f":"IF(A40>0,A40,\"\")","v":1},{"$f":"IF(B40>0,B40,\"\")","v":"1"}]
[]
[{"$f":"IF(A42>0,A42,\"\")","v":2},"2"]
[]
[{"$f":"IF(A44>0,A44,\"\")","v":3},"3"]
[]
[{"$f":"IF(A46>0,A46,\"\")","v":4},"4"]
[]
[{"$f":"IF(A48>0,A48,\"\")","v":5},"5"]
[]
[{"$f":"IF(A50>0,A50,\"\")","v":6},"6"]
[]
[{"$f":"IF(A52>0,A52,\"\")","v":7},"7"]
[]
[{"$f":"IF(A54>0,A54,\"\")","v":8},"8"]
[]
[{"$f":"IF(A56>0,A56,\"\")","v":9},"9"]
[]
[{"$f":"IF(A58>0,A58,\"\")","v":10},"10"]
[]
[{"$f":"IF(A60>0,A60,\"\")","v":11},"11"]
[]
[{"$f":"IF(A62>0,A62,\"\")","v":12},"12"]
[]
[{"$f":"IF(A64>0,A64,\"\")","v":13},"13"]
[]
[{"$f":"IF(A66>0,A66,\"\")","v":14},"14"]
[]
[{"$f":"IF(A68>0,A68,\"\")","v":15},"15"]
[]
[]
["Name","Jg","Sprung"]
[null,null,"D-Note","Abzug OK","E- Abzug","Note"]
[{"$f":"IF(A73>0,A73,\"\")","v":1},{"$f":"IF(B73>0,B73,\"\")","v":"1"}]
[]
[{"$f":"IF(A75>0,A75,\"\")","v":2},"2"]
[]
[{"$f":"IF(A77>0,A77,\"\")","v":3},"3"]
[]
[{"$f":"IF(A79>0,A79,\"\")","v":4},"4"]
[]
[{"$f":"IF(A81>0,A81,\"\")","v":5},"5"]
[]
[{"$f":"IF(A83>0,A83,\"\")","v":6},"6"]
[]
[{"$f":"IF(A85>0,A85,\"\")","v":7},"7"]
[]
[{"$f":"IF(A87>0,A87,\"\")","v":8},"8"]
[]
[{"$f":"IF(A89>0,A89,\"\")","v":9},"9"]
[]
[{"$f":"IF(A91>0,A91,\"\")","v":10},"10"]
[]
[{"$f":"IF(A93>0,A93,\"\")","v":11},"11"]
[]
[{"$f":"IF(A95>0,A95,\"\")","v":12},"12"]
[]
[{"$f":"IF(A97>0,A97,\"\")","v":13},"13"]
[]
[{"$f":"IF(A99>0,A99,\"\")","v":14},"14"]
[]
[{"$f":"IF(A101>0,A101,\"\")","v":15},"15"]
[]
[]
["Name","Jg","Barren"]
[null,null,"D-Note","Abzug OK","E- Abzug","Note"]
[{"$f":"IF(A106>0,A106,\"\")","v":1},{"$f":"IF(B106>0,B106,\"\")","v":"1"}]
[]
[{"$f":"IF(A108>0,A108,\"\")","v":2},"2"]
[]
[{"$f":"IF(A110>0,A110,\"\")","v":3},"3"]
[]
[{"$f":"IF(A112>0,A112,\"\")","v":4},"4"]
[]
[{"$f":"IF(A114>0,A114,\"\")","v":5},"5"]
[]
[{"$f":"IF(A116>0,A116,\"\")","v":6},"6"]
[]
[{"$f":"IF(A118>0,A118,\"\")","v":7},"7"]
[]
[{"$f":"IF(A120>0,A120,\"\")","v":8},"8"]
[]
[{"$f":"IF(A122>0,A122,\"\")","v":9},"9"]
[]
[{"$f":"IF(A124>0,A124,\"\")","v":10},"10"]
[]
[{"$f":"IF(A126>0,A126,\"\")","v":11},"11"]
[]
[{"$f":"IF(A128>0,A128,\"\")","v":12},"12"]
[]
[{"$f":"IF(A130>0,A130,\"\")","v":13},"13"]
[]
[{"$f":"IF(A132>0,A132,\"\")","v":14},"14"]
[]
[{"$f":"IF(A134>0,A134,\"\")","v":15},"15"]
[]
[]
["Name","Jg","Reck"]
[null,null,"D-Note","Abzug OK","E- Abzug","Note"]
[{"$f":"IF(A139>0,A139,\"\")","v":1},{"$f":"IF(B139>0,B139,\"\")","v":"1"}]
[]
[{"$f":"IF(A141>0,A141,\"\")","v":2},"2"]
[]
[{"$f":"IF(A143>0,A143,\"\")","v":3},"3"]
[]
[{"$f":"IF(A145>0,A145,\"\")","v":4},"4"]
[]
[{"$f":"IF(A147>0,A147,\"\")","v":5},"5"]
[]
[{"$f":"IF(A149>0,A149,\"\")","v":6},"6"]
[]
[{"$f":"IF(A151>0,A151,\"\")","v":7},"7"]
[]
[{"$f":"IF(A153>0,A153,\"\")","v":8},"8"]
[]
[{"$f":"IF(A155>0,A155,\"\")","v":9},"9"]
[]
[{"$f":"IF(A157>0,A157,\"\")","v":10},"10"]
[]
[{"$f":"IF(A159>0,A159,\"\")","v":11},"11"]
[]
[{"$f":"IF(A161>0,A161,\"\")","v":12},"12"]
[]
[{"$f":"IF(A163>0,A163,\"\")","v":13},"13"]
[]
[{"$f":"IF(A165>0,A165,\"\")","v":14},"14"]
[]
[{"$f":"IF(A167>0,A167,\"\")","v":15},"15"]

{"sheet":"Wertungszettel M8","index":21,"n_rows":68,"n_cols":14,"rows_kept":68,"cut":false,"hidden":true,"merged":[[0,9,0,10],[67,7,68,7],[67,9,68,9],[67,10,68,10],[67,11,68,11],[67,13,68,13],[2,4,2,5],[2,6,2,10],[2,12,2,13],[65,10,66,10],[65,11,66,11],[65,13,66,13],[63,7,64,7],[63,9,64,9],[63,10,64,10],[63,11,64,11],[63,13,64,13],[61,10,62,10],[61,11,62,11],[61,13,62,13],[59,7,60,7],[59,9,60,9],[59,10,60,10],[59,11,60,11],[67,0,68,0],[67,1,68,1],[67,2,68,2],[67,3,68,3],[67,5,68,5],[67,6,68,6],[65,6,66,6],[65,7,66,7],[65,9,66,9],[65,0,66,0],[65,1,66,1],[65,2,66,2],[65,3,66,3],[65,5,66,5],[63,0,64,0],[63,1,64,1],[63,2,64,2],[63,3,64,3],[63,5,64,5],[63,6,64,6],[61,6,62,6],[61,7,62,7],[61,9,62,9],[59,13,60,13],[61,0,62,0],[61,1,62,1],[61,2,62,2],[61,3,62,3],[61,5,62,5],[59,0,60,0],[59,1,60,1],[59,2,60,2],[59,3,60,3],[59,5,60,5],[59,6,60,6],[57,6,58,6],[57,7,58,7],[57,9,58,9],[57,10,58,10],[57,11,58,11],[57,13,58,13],[55,7,56,7],[55,9,56,9],[55,10,56,10],[55,11,56,11],[55,13,56,13],[55,6,56,6],[57,0,58,0],[57,1,58,1],[57,2,58,2],[57,3,58,3],[57,5,58,5],[55,0,56,0],[55,1,56,1],[55,2,56,2],[55,3,56,3],[55,5,56,5],[53,6,54,6],[53,7,54,7],[53,9,54,9],[53,10,54,10],[53,11,54,11],[53,13,54,13],[51,7,52,7],[51,9,52,9],[51,10,52,10],[51,11,52,11],[51,13,52,13],[51,6,52,6],[53,0,54,0],[53,1,54,1],[53,2,54,2],[53,3,54,3],[53,5,54,5],[51,0,52,0],[51,1,52,1],[51,2,52,2],[51,3,52,3],[51,5,52,5],[49,6,50,6],[49,7,50,7],[49,9,50,9],[49,10,50,10],[49,11,50,11],[49,13,50,13],[47,7,48,7],[47,9,48,9],[47,10,48,10],[47,11,48,11],[47,13,48,13],[47,6,48,6],[49,0,50,0],[49,1,50,1],[49,2,50,2],[49,3,50,3],[49,5,50,5],[47,0,48,0],[47,1,48,1],[47,2,48,2],[47,3,48,3],[47,5,48,5],[45,6,46,6],[45,7,46,7],[45,9,46,9],[45,10,46,10],[45,11,46,11],[45,13,46,13],[43,7,44,7],[43,9,44,9],[43,10,44,10],[43,11,44,11],[43,13,44,13],[43,6,44,6],[45,0,46,0],[45,1,46,1],[45,2,46,2],[45,3,46,3],[45,5,46,5],[43,0,44,0],[43,1,44,1],[43,2,44,2],[43,3,44,3],[43,5,44,5],[41,6,42,6],[41,7,42,7],[41,9,42,9],[41,10,42,10],[41,11,42,11],[41,13,42,13],[39,7,40,7],[39,9,40,9],[39,10,40,10],[39,11,40,11],[39,13,40,13],[39,6,40,6],[41,0,42,0],[41,1,42,1],[41,2,42,2],[41,3,42,3],[41,5,42,5],[39,0,40,0],[39,1,40,1],[39,2,40,2],[39,3,40,3],[39,5,40,5],[34,7,35,7],[34,9,35,9],[34,10,35,10],[34,11,35,11],[34,13,35,13],[37,2,37,5],[37,6,37,9],[37,10,37,13],[34,0,35,0],[34,1,35,1],[34,2,35,2],[34,3,35,3],[34,5,35,5],[34,6,35,6],[32,6,33,6],[32,7,33,7],[32,9,33,9],[32,10,33,10],[32,11,33,11],[32,13,33,13],[30,7,31,7],[30,9,31,9],[30,10,31,10],[30,11,31,11],[30,13,31,13],[30,6,31,6],[32,0,33,0],[32,1,33,1],[32,2,33,2],[32,3,33,3],[32,5,33,5],[30,0,31,0],[30,1,31,1],[30,2,31,2],[30,3,31,3],[30,5,31,5],[28,6,29,6],[28,7,29,7],[28,9,29,9],[28,10,29,10],[28,11,29,11],[28,13,29,13],[26,7,27,7],[26,9,27,9],[26,10,27,10],[26,11,27,11],[26,13,27,13],[26,6,27,6],[28,0,29,0],[28,1,29,1],[28,2,29,2],[28,3,29,3],[28,5,29,5],[26,0,27,0],[26,1,27,1],[26,2,27,2],[26,3,27,3],[26,5,27,5],[24,6,25,6],[24,7,25,7],[24,9,25,9],[24,10,25,10],[24,11,25,11],[24,13,25,13],[22,7,23,7],[22,9,23,9],[22,10,23,10],[22,11,23,11],[22,13,23,13],[22,6,23,6],[24,0,25,0],[24,1,25,1],[24,2,25,2],[24,3,25,3],[24,5,25,5],[22,0,23,0],[22,1,23,1],[22,2,23,2],[22,3,23,3],[22,5,23,5],[14,13,15,13],[14,6,15,6],[20,0,21,0],[20,1,21,1],[20,2,21,2],[20,3,21,3],[20,5,21,5],[18,0,19,0],[18,1,19,1],[18,2,19,2],[18,3,19,3],[18,5,19,5],[20,6,21,6],[20,7,21,7],[20,9,21,9],[20,10,21,10],[20,11,21,11],[20,13,21,13],[18,7,19,7],[18,9,19,9],[18,10,19,10],[18,11,19,11],[18,13,19,13],[18,6,19,6],[10,10,11,10],[10,11,11,11],[10,13,11,13],[10,6,11,6],[16,0,17,0],[16,1,17,1],[16,2,17,2],[16,3,17,3],[16,5,17,5],[14,0,15,0],[14,1,15,1],[14,2,15,2],[14,3,15,3],[14,5,15,5],[16,6,17,6],[16,7,17,7],[16,9,17,9],[16,10,17,10],[16,11,17,11],[16,13,17,13],[14,7,15,7],[14,9,15,9],[14,10,15,10],[14,11,15,11],[6,7,7,7],[6,9,7,9],[6,10,7,10],[6,11,7,11],[6,13,7,13],[6,6,7,6],[12,0,13,0],[12,1,13,1],[12,2,13,2],[12,3,13,3],[12,5,13,5],[10,0,11,0],[10,1,11,1],[10,2,11,2],[10,3,11,3],[10,5,11,5],[12,6,13,6],[12,7,13,7],[12,9,13,9],[12,10,13,10],[12,11,13,11],[12,13,13,13],[10,7,11,7],[10,9,11,9],[1,4,1,5],[1,6,1,10],[4,2,4,5],[4,6,4,9],[4,10,4,13],[1,12,1,13],[0,4,0,5],[0,6,0,8],[8,0,9,0],[8,1,9,1],[8,2,9,2],[8,3,9,3],[8,5,9,5],[6,0,7,0],[6,1,7,1],[6,2,7,2],[6,3,7,3],[6,5,7,5],[8,6,9,6],[8,7,9,7],[8,9,9,9],[8,10,9,10],[8,11,9,11],[8,13,9,13]]}
["Wettkampfbogen",null,null,null,"Ort / Datum :",null,{"$f":"'INFO Blatt'!B11","v":"Hehlen"},null,null,{"$f":"'INFO Blatt'!B13","v":"2019-02-16"}]
[null,null,null,null,"Mannschaft:",null,{"$f":"Formeln!A12","v":"M8"},null,null,null,null,null,"Wertungsvorschriften"]
[null,null,null,null,"Liga:",null,{"$f":"'INFO Blatt'!B7","v":"Einsteigerliga"},null,null,null,null,null,{"$f":"'INFO Blatt'!B5","v":"P und AK"}]
[]
["Name","Jg","Boden",null,null,null,"Ringe",null,null,null,"Barren"]
[null,null,"D-Note","Abzug OK","E- Abzug","Note","D-Note","Abzug OK","E- Abzug","Note","D-Note","Abzug OK","E-Abzug","Note"]
[8]
[]
[]
[]
[]
[]
[]
[]
[]
[]
[]
[]
[]
[]
[]
[]
[]
[]
[]
[]
[]
[]
[]
[]
[]
[]
[]
[]
[]
[]
[]
["Name","Jg","Pauschenpferd",null,null,null,"Sprung",null,null,null,"Reck"]
[null,null,"D-Note","Abzug OK","E- Abzug","Note","D-Note","Abzug OK","E- Abzug","Note","D-Note","Abzug OK","E-Abzug","Note"]
[]
[]
[null,{"$f":"IF(B9>0,B9,\"\")","v":""}]
[]
[null,{"$f":"IF(B11>0,B11,\"\")","v":""}]
[]
[null,{"$f":"IF(B13>0,B13,\"\")","v":""}]
[]
[null,{"$f":"IF(B15>0,B15,\"\")","v":""}]
[]
[null,{"$f":"IF(B17>0,B17,\"\")","v":""}]
[]
[null,{"$f":"IF(B19>0,B19,\"\")","v":""}]
[]
[null,{"$f":"IF(B21>0,B21,\"\")","v":""}]
[]
[null,{"$f":"IF(B23>0,B23,\"\")","v":""}]
[]
[null,{"$f":"IF(B25>0,B25,\"\")","v":""}]
[]
[null,{"$f":"IF(B27>0,B27,\"\")","v":""}]
[]
[null,{"$f":"IF(B29>0,B29,\"\")","v":""}]
[]
[null,{"$f":"IF(B31>0,B31,\"\")","v":""}]
[]
[null,{"$f":"IF(B33>0,B33,\"\")","v":""}]
[]
[{"$f":"IF(A35>0,A35,\"\")","v":""},""]

{"sheet":"Wertungszettel M9","index":22,"n_rows":68,"n_cols":14,"rows_kept":68,"cut":false,"hidden":true,"merged":[[0,9,0,10],[67,7,68,7],[67,9,68,9],[67,10,68,10],[67,11,68,11],[67,13,68,13],[2,4,2,5],[2,6,2,10],[2,12,2,13],[65,10,66,10],[65,11,66,11],[65,13,66,13],[63,7,64,7],[63,9,64,9],[63,10,64,10],[63,11,64,11],[63,13,64,13],[61,10,62,10],[61,11,62,11],[61,13,62,13],[59,7,60,7],[59,9,60,9],[59,10,60,10],[59,11,60,11],[67,0,68,0],[67,1,68,1],[67,2,68,2],[67,3,68,3],[67,5,68,5],[67,6,68,6],[65,6,66,6],[65,7,66,7],[65,9,66,9],[65,0,66,0],[65,1,66,1],[65,2,66,2],[65,3,66,3],[65,5,66,5],[63,0,64,0],[63,1,64,1],[63,2,64,2],[63,3,64,3],[63,5,64,5],[63,6,64,6],[61,6,62,6],[61,7,62,7],[61,9,62,9],[59,13,60,13],[61,0,62,0],[61,1,62,1],[61,2,62,2],[61,3,62,3],[61,5,62,5],[59,0,60,0],[59,1,60,1],[59,2,60,2],[59,3,60,3],[59,5,60,5],[59,6,60,6],[57,6,58,6],[57,7,58,7],[57,9,58,9],[57,10,58,10],[57,11,58,11],[57,13,58,13],[55,7,56,7],[55,9,56,9],[55,10,56,10],[55,11,56,11],[55,13,56,13],[55,6,56,6],[57,0,58,0],[57,1,58,1],[57,2,58,2],[57,3,58,3],[57,5,58,5],[55,0,56,0],[55,1,56,1],[55,2,56,2],[55,3,56,3],[55,5,56,5],[53,6,54,6],[53,7,54,7],[53,9,54,9],[53,10,54,10],[53,11,54,11],[53,13,54,13],[51,7,52,7],[51,9,52,9],[51,10,52,10],[51,11,52,11],[51,13,52,13],[51,6,52,6],[53,0,54,0],[53,1,54,1],[53,2,54,2],[53,3,54,3],[53,5,54,5],[51,0,52,0],[51,1,52,1],[51,2,52,2],[51,3,52,3],[51,5,52,5],[49,6,50,6],[49,7,50,7],[49,9,50,9],[49,10,50,10],[49,11,50,11],[49,13,50,13],[47,7,48,7],[47,9,48,9],[47,10,48,10],[47,11,48,11],[47,13,48,13],[47,6,48,6],[49,0,50,0],[49,1,50,1],[49,2,50,2],[49,3,50,3],[49,5,50,5],[47,0,48,0],[47,1,48,1],[47,2,48,2],[47,3,48,3],[47,5,48,5],[45,6,46,6],[45,7,46,7],[45,9,46,9],[45,10,46,10],[45,11,46,11],[45,13,46,13],[43,7,44,7],[43,9,44,9],[43,10,44,10],[43,11,44,11],[43,13,44,13],[43,6,44,6],[45,0,46,0],[45,1,46,1],[45,2,46,2],[45,3,46,3],[45,5,46,5],[43,0,44,0],[43,1,44,1],[43,2,44,2],[43,3,44,3],[43,5,44,5],[41,6,42,6],[41,7,42,7],[41,9,42,9],[41,10,42,10],[41,11,42,11],[41,13,42,13],[39,7,40,7],[39,9,40,9],[39,10,40,10],[39,11,40,11],[39,13,40,13],[39,6,40,6],[41,0,42,0],[41,1,42,1],[41,2,42,2],[41,3,42,3],[41,5,42,5],[39,0,40,0],[39,1,40,1],[39,2,40,2],[39,3,40,3],[39,5,40,5],[34,7,35,7],[34,9,35,9],[34,10,35,10],[34,11,35,11],[34,13,35,13],[37,2,37,5],[37,6,37,9],[37,10,37,13],[34,0,35,0],[34,1,35,1],[34,2,35,2],[34,3,35,3],[34,5,35,5],[34,6,35,6],[32,6,33,6],[32,7,33,7],[32,9,33,9],[32,10,33,10],[32,11,33,11],[32,13,33,13],[30,7,31,7],[30,9,31,9],[30,10,31,10],[30,11,31,11],[30,13,31,13],[30,6,31,6],[32,0,33,0],[32,1,33,1],[32,2,33,2],[32,3,33,3],[32,5,33,5],[30,0,31,0],[30,1,31,1],[30,2,31,2],[30,3,31,3],[30,5,31,5],[28,6,29,6],[28,7,29,7],[28,9,29,9],[28,10,29,10],[28,11,29,11],[28,13,29,13],[26,7,27,7],[26,9,27,9],[26,10,27,10],[26,11,27,11],[26,13,27,13],[26,6,27,6],[28,0,29,0],[28,1,29,1],[28,2,29,2],[28,3,29,3],[28,5,29,5],[26,0,27,0],[26,1,27,1],[26,2,27,2],[26,3,27,3],[26,5,27,5],[24,6,25,6],[24,7,25,7],[24,9,25,9],[24,10,25,10],[24,11,25,11],[24,13,25,13],[22,7,23,7],[22,9,23,9],[22,10,23,10],[22,11,23,11],[22,13,23,13],[22,6,23,6],[24,0,25,0],[24,1,25,1],[24,2,25,2],[24,3,25,3],[24,5,25,5],[22,0,23,0],[22,1,23,1],[22,2,23,2],[22,3,23,3],[22,5,23,5],[14,13,15,13],[14,6,15,6],[20,0,21,0],[20,1,21,1],[20,2,21,2],[20,3,21,3],[20,5,21,5],[18,0,19,0],[18,1,19,1],[18,2,19,2],[18,3,19,3],[18,5,19,5],[20,6,21,6],[20,7,21,7],[20,9,21,9],[20,10,21,10],[20,11,21,11],[20,13,21,13],[18,7,19,7],[18,9,19,9],[18,10,19,10],[18,11,19,11],[18,13,19,13],[18,6,19,6],[10,10,11,10],[10,11,11,11],[10,13,11,13],[10,6,11,6],[16,0,17,0],[16,1,17,1],[16,2,17,2],[16,3,17,3],[16,5,17,5],[14,0,15,0],[14,1,15,1],[14,2,15,2],[14,3,15,3],[14,5,15,5],[16,6,17,6],[16,7,17,7],[16,9,17,9],[16,10,17,10],[16,11,17,11],[16,13,17,13],[14,7,15,7],[14,9,15,9],[14,10,15,10],[14,11,15,11],[6,7,7,7],[6,9,7,9],[6,10,7,10],[6,11,7,11],[6,13,7,13],[6,6,7,6],[12,0,13,0],[12,1,13,1],[12,2,13,2],[12,3,13,3],[12,5,13,5],[10,0,11,0],[10,1,11,1],[10,2,11,2],[10,3,11,3],[10,5,11,5],[12,6,13,6],[12,7,13,7],[12,9,13,9],[12,10,13,10],[12,11,13,11],[12,13,13,13],[10,7,11,7],[10,9,11,9],[1,4,1,5],[1,6,1,10],[4,2,4,5],[4,6,4,9],[4,10,4,13],[1,12,1,13],[0,4,0,5],[0,6,0,8],[8,0,9,0],[8,1,9,1],[8,2,9,2],[8,3,9,3],[8,5,9,5],[6,0,7,0],[6,1,7,1],[6,2,7,2],[6,3,7,3],[6,5,7,5],[8,6,9,6],[8,7,9,7],[8,9,9,9],[8,10,9,10],[8,11,9,11],[8,13,9,13]]}
["Wettkampfbogen",null,null,null,"Ort / Datum :",null,{"$f":"'INFO Blatt'!B11","v":"Hehlen"},null,null,{"$f":"'INFO Blatt'!B13","v":"2019-02-16"}]
[null,null,null,null,"Mannschaft:",null,{"$f":"Formeln!A13","v":"M9"},null,null,null,null,null,"Wertungsvorschriften"]
[null,null,null,null,"Liga:",null,{"$f":"'INFO Blatt'!B7","v":"Einsteigerliga"},null,null,null,null,null,{"$f":"'INFO Blatt'!B5","v":"P und AK"}]
[]
["Name","Jg","Boden",null,null,null,"Ringe",null,null,null,"Barren"]
[null,null,"D-Note","Abzug OK","E- Abzug","Note","D-Note","Abzug OK","E- Abzug","Note","D-Note","Abzug OK","E-Abzug","Note"]
[9,{"$f":"IF('M5'!C9>0,'M5'!C9,\"\")","v":""}]
[]
[null,{"$f":"IF('M5'!C11>0,'M5'!C11,\"\")","v":""}]
[]
[null,{"$f":"IF('M5'!C13>0,'M5'!C13,\"\")","v":""}]
[]
[null,{"$f":"IF('M5'!C15>0,'M5'!C15,\"\")","v":""}]
[]
[null,{"$f":"IF('M5'!C17>0,'M5'!C17,\"\")","v":""}]
[]
[null,{"$f":"IF('M5'!C19>0,'M5'!C19,\"\")","v":""}]
[]
[null,{"$f":"IF('M5'!C21>0,'M5'!C21,\"\")","v":""}]
[]
[null,{"$f":"IF('M5'!C23>0,'M5'!C23,\"\")","v":""}]
[]
[null,{"$f":"IF('M5'!C25>0,'M5'!C25,\"\")","v":""}]
[]
[null,{"$f":"IF('M5'!C27>0,'M5'!C27,\"\")","v":""}]
[]
[]
[]
[]
[]
[]
[]
[null,{"$f":"IF('M5'!C41>0,'M5'!C41,\"\")","v":""}]
[]
[null,{"$f":"IF('M5'!C43>0,'M5'!C43,\"\")","v":""}]
[]
[]
["Name","Jg","Pauschenpferd",null,null,null,"Sprung",null,null,null,"Reck"]
[null,null,"D-Note","Abzug OK","E- Abzug","Note","D-Note","Abzug OK","E- Abzug","Note","D-Note","Abzug OK","E-Abzug","Note"]
[{"$f":"IF(A7>0,A7,\"\")","v":9},{"$f":"IF(B7>0,B7,\"\")","v":""}]
[]
[{"$f":"IF(A9>0,A9,\"\")","v":""},""]
[]
[{"$f":"IF(A11>0,A11,\"\")","v":""},""]
[]
[{"$f":"IF(A13>0,A13,\"\")","v":""},""]
[]
[{"$f":"IF(A15>0,A15,\"\")","v":""},""]
[]
[{"$f":"IF(A17>0,A17,\"\")","v":""},""]
[]
[{"$f":"IF(A19>0,A19,\"\")","v":""},""]
[]
[{"$f":"IF(A21>0,A21,\"\")","v":""},""]
[]
[{"$f":"IF(A23>0,A23,\"\")","v":""},""]
[]
[{"$f":"IF(A25>0,A25,\"\")","v":""},""]
[]
[{"$f":"IF(A27>0,A27,\"\")","v":""},""]
[]
[{"$f":"IF(A29>0,A29,\"\")","v":""},""]
[]
[{"$f":"IF(A31>0,A31,\"\")","v":""},""]
[]
[{"$f":"IF(A33>0,A33,\"\")","v":""},""]
[]
[{"$f":"IF(A35>0,A35,\"\")","v":""},""]

{"sheet":"Wertungszettel M10","index":23,"n_rows":68,"n_cols":14,"rows_kept":68,"cut":false,"hidden":true,"merged":[[0,9,0,10],[67,7,68,7],[67,9,68,9],[67,10,68,10],[67,11,68,11],[67,13,68,13],[2,4,2,5],[2,6,2,10],[2,12,2,13],[65,10,66,10],[65,11,66,11],[65,13,66,13],[63,7,64,7],[63,9,64,9],[63,10,64,10],[63,11,64,11],[63,13,64,13],[61,10,62,10],[61,11,62,11],[61,13,62,13],[59,7,60,7],[59,9,60,9],[59,10,60,10],[59,11,60,11],[67,0,68,0],[67,1,68,1],[67,2,68,2],[67,3,68,3],[67,5,68,5],[67,6,68,6],[65,6,66,6],[65,7,66,7],[65,9,66,9],[65,0,66,0],[65,1,66,1],[65,2,66,2],[65,3,66,3],[65,5,66,5],[63,0,64,0],[63,1,64,1],[63,2,64,2],[63,3,64,3],[63,5,64,5],[63,6,64,6],[61,6,62,6],[61,7,62,7],[61,9,62,9],[59,13,60,13],[61,0,62,0],[61,1,62,1],[61,2,62,2],[61,3,62,3],[61,5,62,5],[59,0,60,0],[59,1,60,1],[59,2,60,2],[59,3,60,3],[59,5,60,5],[59,6,60,6],[57,6,58,6],[57,7,58,7],[57,9,58,9],[57,10,58,10],[57,11,58,11],[57,13,58,13],[55,7,56,7],[55,9,56,9],[55,10,56,10],[55,11,56,11],[55,13,56,13],[55,6,56,6],[57,0,58,0],[57,1,58,1],[57,2,58,2],[57,3,58,3],[57,5,58,5],[55,0,56,0],[55,1,56,1],[55,2,56,2],[55,3,56,3],[55,5,56,5],[53,6,54,6],[53,7,54,7],[53,9,54,9],[53,10,54,10],[53,11,54,11],[53,13,54,13],[51,7,52,7],[51,9,52,9],[51,10,52,10],[51,11,52,11],[51,13,52,13],[51,6,52,6],[53,0,54,0],[53,1,54,1],[53,2,54,2],[53,3,54,3],[53,5,54,5],[51,0,52,0],[51,1,52,1],[51,2,52,2],[51,3,52,3],[51,5,52,5],[49,6,50,6],[49,7,50,7],[49,9,50,9],[49,10,50,10],[49,11,50,11],[49,13,50,13],[47,7,48,7],[47,9,48,9],[47,10,48,10],[47,11,48,11],[47,13,48,13],[47,6,48,6],[49,0,50,0],[49,1,50,1],[49,2,50,2],[49,3,50,3],[49,5,50,5],[47,0,48,0],[47,1,48,1],[47,2,48,2],[47,3,48,3],[47,5,48,5],[45,6,46,6],[45,7,46,7],[45,9,46,9],[45,10,46,10],[45,11,46,11],[45,13,46,13],[43,7,44,7],[43,9,44,9],[43,10,44,10],[43,11,44,11],[43,13,44,13],[43,6,44,6],[45,0,46,0],[45,1,46,1],[45,2,46,2],[45,3,46,3],[45,5,46,5],[43,0,44,0],[43,1,44,1],[43,2,44,2],[43,3,44,3],[43,5,44,5],[41,6,42,6],[41,7,42,7],[41,9,42,9],[41,10,42,10],[41,11,42,11],[41,13,42,13],[39,7,40,7],[39,9,40,9],[39,10,40,10],[39,11,40,11],[39,13,40,13],[39,6,40,6],[41,0,42,0],[41,1,42,1],[41,2,42,2],[41,3,42,3],[41,5,42,5],[39,0,40,0],[39,1,40,1],[39,2,40,2],[39,3,40,3],[39,5,40,5],[34,7,35,7],[34,9,35,9],[34,10,35,10],[34,11,35,11],[34,13,35,13],[37,2,37,5],[37,6,37,9],[37,10,37,13],[34,0,35,0],[34,1,35,1],[34,2,35,2],[34,3,35,3],[34,5,35,5],[34,6,35,6],[32,6,33,6],[32,7,33,7],[32,9,33,9],[32,10,33,10],[32,11,33,11],[32,13,33,13],[30,7,31,7],[30,9,31,9],[30,10,31,10],[30,11,31,11],[30,13,31,13],[30,6,31,6],[32,0,33,0],[32,1,33,1],[32,2,33,2],[32,3,33,3],[32,5,33,5],[30,0,31,0],[30,1,31,1],[30,2,31,2],[30,3,31,3],[30,5,31,5],[28,6,29,6],[28,7,29,7],[28,9,29,9],[28,10,29,10],[28,11,29,11],[28,13,29,13],[26,7,27,7],[26,9,27,9],[26,10,27,10],[26,11,27,11],[26,13,27,13],[26,6,27,6],[28,0,29,0],[28,1,29,1],[28,2,29,2],[28,3,29,3],[28,5,29,5],[26,0,27,0],[26,1,27,1],[26,2,27,2],[26,3,27,3],[26,5,27,5],[24,6,25,6],[24,7,25,7],[24,9,25,9],[24,10,25,10],[24,11,25,11],[24,13,25,13],[22,7,23,7],[22,9,23,9],[22,10,23,10],[22,11,23,11],[22,13,23,13],[22,6,23,6],[24,0,25,0],[24,1,25,1],[24,2,25,2],[24,3,25,3],[24,5,25,5],[22,0,23,0],[22,1,23,1],[22,2,23,2],[22,3,23,3],[22,5,23,5],[14,13,15,13],[14,6,15,6],[20,0,21,0],[20,1,21,1],[20,2,21,2],[20,3,21,3],[20,5,21,5],[18,0,19,0],[18,1,19,1],[18,2,19,2],[18,3,19,3],[18,5,19,5],[20,6,21,6],[20,7,21,7],[20,9,21,9],[20,10,21,10],[20,11,21,11],[20,13,21,13],[18,7,19,7],[18,9,19,9],[18,10,19,10],[18,11,19,11],[18,13,19,13],[18,6,19,6],[10,10,11,10],[10,11,11,11],[10,13,11,13],[10,6,11,6],[16,0,17,0],[16,1,17,1],[16,2,17,2],[16,3,17,3],[16,5,17,5],[14,0,15,0],[14,1,15,1],[14,2,15,2],[14,3,15,3],[14,5,15,5],[16,6,17,6],[16,7,17,7],[16,9,17,9],[16,10,17,10],[16,11,17,11],[16,13,17,13],[14,7,15,7],[14,9,15,9],[14,10,15,10],[14,11,15,11],[6,7,7,7],[6,9,7,9],[6,10,7,10],[6,11,7,11],[6,13,7,13],[6,6,7,6],[12,0,13,0],[12,1,13,1],[12,2,13,2],[12,3,13,3],[12,5,13,5],[10,0,11,0],[10,1,11,1],[10,2,11,2],[10,3,11,3],[10,5,11,5],[12,6,13,6],[12,7,13,7],[12,9,13,9],[12,10,13,10],[12,11,13,11],[12,13,13,13],[10,7,11,7],[10,9,11,9],[1,4,1,5],[1,6,1,10],[4,2,4,5],[4,6,4,9],[4,10,4,13],[1,12,1,13],[0,4,0,5],[0,6,0,8],[8,0,9,0],[8,1,9,1],[8,2,9,2],[8,3,9,3],[8,5,9,5],[6,0,7,0],[6,1,7,1],[6,2,7,2],[6,3,7,3],[6,5,7,5],[8,6,9,6],[8,7,9,7],[8,9,9,9],[8,10,9,10],[8,11,9,11],[8,13,9,13]]}
["Wettkampfbogen",null,null,null,"Ort / Datum :",null,{"$f":"'INFO Blatt'!B11","v":"Hehlen"},null,null,{"$f":"'INFO Blatt'!B13","v":"2019-02-16"}]
[null,null,null,null,"Mannschaft:",null,{"$f":"Formeln!A14","v":"M10"},null,null,null,null,null,"Wertungsvorschriften"]
[null,null,null,null,"Liga:",null,{"$f":"'INFO Blatt'!B7","v":"Einsteigerliga"},null,null,null,null,null,{"$f":"'INFO Blatt'!B5","v":"P und AK"}]
[]
["Name","Jg","Boden",null,null,null,"Ringe",null,null,null,"Barren"]
[null,null,"D-Note","Abzug OK","E- Abzug","Note","D-Note","Abzug OK","E- Abzug","Note","D-Note","Abzug OK","E-Abzug","Note"]
[10,{"$f":"IF('M6'!C9>0,'M6'!C9,\"\")","v":""}]
[]
[null,{"$f":"IF('M6'!C11>0,'M6'!C11,\"\")","v":""}]
[]
[null,{"$f":"IF('M6'!C13>0,'M6'!C13,\"\")","v":""}]
[]
[null,{"$f":"IF('M6'!C15>0,'M6'!C15,\"\")","v":""}]
[]
[null,{"$f":"IF('M6'!C17>0,'M6'!C17,\"\")","v":""}]
[]
[null,{"$f":"IF('M6'!C19>0,'M6'!C19,\"\")","v":""}]
[]
[null,{"$f":"IF('M6'!C21>0,'M6'!C21,\"\")","v":""}]
[]
[null,{"$f":"IF('M6'!C23>0,'M6'!C23,\"\")","v":""}]
[]
[null,{"$f":"IF('M6'!C25>0,'M6'!C25,\"\")","v":""}]
[]
[null,{"$f":"IF('M6'!C27>0,'M6'!C27,\"\")","v":""}]
[]
[]
[]
[]
[]
[null,{"$f":"IF('M6'!C39>0,'M6'!C39,\"\")","v":""}]
[]
[null,{"$f":"IF('M6'!C41>0,'M6'!C41,\"\")","v":""}]
[]
[null,{"$f":"IF('M6'!C43>0,'M6'!C43,\"\")","v":""}]
[]
[]
["Name","Jg","Pauschenpferd",null,null,null,"Sprung",null,null,null,"Reck"]
[null,null,"D-Note","Abzug OK","E- Abzug","Note","D-Note","Abzug OK","E- Abzug","Note","D-Note","Abzug OK","E-Abzug","Note"]
[{"$f":"IF(A7>0,A7,\"\")","v":10},{"$f":"IF(B7>0,B7,\"\")","v":""}]
[]
[{"$f":"IF(A9>0,A9,\"\")","v":""},""]
[]
[{"$f":"IF(A11>0,A11,\"\")","v":""},""]
[]
[{"$f":"IF(A13>0,A13,\"\")","v":""},""]
[]
[{"$f":"IF(A15>0,A15,\"\")","v":""},""]
[]
[{"$f":"IF(A17>0,A17,\"\")","v":""},""]
[]
[{"$f":"IF(A19>0,A19,\"\")","v":""},""]
[]
[{"$f":"IF(A21>0,A21,\"\")","v":""},""]
[]
[{"$f":"IF(A23>0,A23,\"\")","v":""},""]
[]
[{"$f":"IF(A25>0,A25,\"\")","v":""},""]
[]
[{"$f":"IF(A27>0,A27,\"\")","v":""},""]
[]
[{"$f":"IF(A29>0,A29,\"\")","v":""},""]
[]
[{"$f":"IF(A31>0,A31,\"\")","v":""},""]
[]
[{"$f":"IF(A33>0,A33,\"\")","v":""},""]
[]
[{"$f":"IF(A35>0,A35,\"\")","v":""},""]